{"text_format":"1","workbook":"xlsx","n_sheets":5,"sheets":["LargeGraphs","SHELLCALC","Revisions","About","Calculations"],"not_rendered":{"charts":6,"images":0,"macros":1,"external_links":0,"defined_names":18,"comments":0,"pivot_tables":0},"unopened":[],"bounds":{"document_bytes":16777216,"sheet_cells":100000,"rows_first":2000,"rows_last":500,"rows_between":2000,"halvings":0,"cell_chars":16384,"cell_head_chars":4096},"cells_cut":0,"cells_raw":0,"read":"whole","date_system":"1900"}

{"sheet":"LargeGraphs","index":0,"n_rows":0,"n_cols":0,"rows_kept":0,"cut":false,"hidden":false,"merged":[]}

{"sheet":"SHELLCALC","index":1,"n_rows":17,"n_cols":17,"rows_kept":17,"cut":false,"hidden":false,"merged":[[3,1,3,3],[3,5,3,7],[0,1,0,3],[0,5,0,7]]}
[null,"ShellCalc© v4.1.2",null,null,null,"Developed by John Harradine, Manly, Queensland, Australia\nAdditions by Tom Smith, Davas Ltd, UK - effective 21 July 2010.  \nSee http://www.jpyro.com/wp?p=23 for more details",null,null,null,null,null,null,null,null,null,"Size","Terrrain Categories"]
[null,null,null,null,null,null,null,null,null,null,null,null,null,null,null,"½\" (13mm)",2]
[null,null,null,null,null,null,null,null,null,null,null,null,null,null,null,"1\" (25mm)",3]
[null,"Input",null,null,null,"Output",null,null,null,null,null,null,null,null,null,"10\" (250mm)","None"]
[null,"Units","Metric",null,null,"Max Downrange Carry",{"$f":"IF(is_imp,Calculations!N7/0.305,Calculations!N7)","v":47.974235392591467},{"$f":"IF(is_imp,\"ft\",\"m\")","v":"m"},null,null,null,null,null,null,null,"1½\" (38mm)"]
[null,"Type","Comets",null,null,"Max Height (from Ground Level)",{"$f":"IF(is_imp,Calculations!N8/0.305,Calculations!N8)","v":140},{"$f":"IF(is_imp,\"ft\",\"m\")","v":"m"},null,null,null,null,null,null,null,"12\" (300mm)"]
[null,{"$f":"IF(is_shell, \"Shell Diameter\",\"Comet Diameter\")","v":"Comet Diameter"},"1¼\" (30mm)",null,null,"Max Crossrange Carry",{"$f":"IF(is_imp,Calculations!N9/0.305,Calculations!N9)","v":1.0586472250070716E-15},{"$f":"IF(is_imp,\"ft\",\"m\")","v":"m"},null,null,null,null,null,null,null,"2\" (50mm)","Comet Choices"]
[null,{"$f":"IF(is_comet,\"Roman Candle Angle\",\"Mortar Angle\")","v":"Roman Candle Angle"},120,"° from vertical",null,{"$f":"IF(is_shell,\"Approx Burst Diameter\",\"\")","v":""},{"$f":"IF(is_shell,+Calculations!N18*2,0)","v":0},{"$f":"IF(is_shell,IF(is_imp,\"ft\",\"m\"),\"\")","v":""},null,null,null,null,null,null,null,"2½\" (63mm)","C"]
[null,"Muzzle Velocity",null,{"$f":"IF(is_imp,\"ft/s - if known\",\"m/s - if known\")","v":"m/s - if known"},null,"Ascent Time",{"$f":"IF(is_shell,Calculations!N5,\"\")","v":""},"s",null,null,null,null,null,null,null,"3\" (75mm)","S"]
[null,{"$f":"IF(is_shell,\"Fuse Delay\",\"Comet Burning Time\")","v":"Comet Burning Time"},3,"s - if known",null,{"$f":"IF(is_shell,\"Burst Time\",\"Effect Duration\")","v":"Effect Duration"},{"$f":"IF(Fuse_Delay>0,Fuse_Delay,VLOOKUP(C7,shell_data,7))","v":3},"s",null,null,null,null,null,null,null,"4\" (100mm)"]
[null,{"$f":"IF(is_shell,\"Shell Mass\",\"Comet Mass\")","v":"Comet Mass"},null,{"$f":"IF(is_imp,\"lb - if known\",\"g - if known\")","v":"g - if known"},null,"Burst Distance (from firing point)",{"$f":"+Calculations!N10","v":47.441050008873276},"m",null,null,null,null,null,null,null,"5\" (125mm)","Unit Choices"]
[null,"Tumbling/Mortar Drift","None",null,null,"Burst Height (from Ground Level)",{"$f":"IF(is_imp,Calculations!N12/0.305,Calculations!N12)","v":87.340100442375913},"m",null,null,null,null,null,null,null,"6\" (150mm)","I"]
[null,"Wind Speed",10,{"$f":"IF(is_imp,\"kts\",\"km/h\")","v":"km/h"},null,null,null,null,null,null,null,null,null,null,null,"7\" (175mm)","M"]
[null,"Relative Wind Direction",180,"degrees",null,null,null,null,null,null,null,null,null,null,null,"8\" (200mm)"]
[null,"Elevation of Launch Site",300,{"$f":"IF(is_imp,\"ft AMSL\",\"m AMSL\")","v":"m AMSL"},null,{"$f":"IF(is_comet,\"Time at All Burnt\",\"Max Flight Time (if shell does not burst)\")","v":"Time at All Burnt"},{"$f":"IF(is_comet,Calculations!$N$14,Calculations!N6)","v":3.0000000000000013},"s"]
[null,"Height of launch",140,"m from ground level",null,"Muzzle Velocity (Calculated)",{"$f":"+Calculations!B7","v":90},{"$f":"IF(is_imp,\"ft/s\",\"m/s\")","v":"m/s"}]
[null,"Terrain Category",2,"(refer AS1170.2)",null,{"$f":"IF(is_shell,\"Shell Mass\",\"Comet Mass\")","v":"Comet Mass"},{"$f":"IF(C11=\"\",IF(is_imp,Calculations!B19/0.454,Calculations!B19*1000),SHELLCALC!C11)","v":15.70703477200033},{"$f":"IF(is_imp,\"lb\",\"g\")","v":"g"}]

{"sheet":"Revisions","index":2,"n_rows":8,"n_cols":11,"rows_kept":8,"cut":false,"hidden":true,"merged":[]}
["Revision Log"]
[null,null,null,null,null,null,null,null,"Current Version",null,{"$f":"+version","v":"ShellCalc© v4.1.2"}]
[]
[3.1,2000,"JH","original progam"]
[3.2,2005,"TS","incorporates shell bursts"]
[4.0999999999999996,"2010-07-21","TS","allows firing above ground level"]
["4.1.1","2010-07-22","TS","more diameters"]
["4.1.2","2010-07-23","TS","Shell data inc Vo from Russell's book"]

{"sheet":"About","index":3,"n_rows":12,"n_cols":2,"rows_kept":12,"cut":false,"hidden":false,"merged":[]}
[]
[null,{"$f":"+\"About \"&version","v":"About ShellCalc© v4.1.2"}]
[]
[null,"SHELLCALC© is a freeware program designed to assist:"]
[null,"M fireworks operators to plan a display, especially where a risk or hazard assessment is required;"]
[null,"M   fireworks regulators to develop safe distances and establish risk regimes for fireworks displays;"]
[null,"M   enforcement and investigative agencies to predict possible outcomes of \"near misses\", or to confirm actual incident data, particularly for presentation in court or in investigation reports;"]
[null,"M    fireworks testers, to establish a safe template for test firings; and"]
[null,"M    fireworks manufacturers, to establish safe distances for their products and predict the effect of variable fuse delay times on burst height."]
[null,"SHELLCALC© is a freeware program and is designed to run on Microsoft® Excel 2007 or later - limited functionality may be available in previous versions of Excel."]
[null,"Copies of this program and updates may be obtained directly from the Journal of Pyrotechnics Web-site - click link below"]
[null,"http://www.jpyro.com/wp/?p=23"]

{"sheet":"Calculations","index":4,"n_rows":259,"n_cols":44,"rows_kept":259,"cut":false,"hidden":true,"merged":[]}
["SHELLCALC v4.1 ",null,null,null,null,null,null,null,null,null,null,null,null,null,null,null,null,null,"Burst Calculations"]
["2010-07-21",null,null,null,null,null,null,null,null,null,null,null,null,null,null,null,null,null,"Inc","cos",null,"x val","y1 val","y2 val","z1 val","z2 val"]
[null,null,null,null,null,null,null,null,null,null,null,null,null,null,null,null,null,null,-10,{"$f":"$N$18*S3/10","v":0},{"$f":"+SQRT(($N$18*$N$18)-(T3*T3))","v":0},{"$f":"IF($B$24=\"s\",$N$10+$N$18*S3/10,0)","v":0},{"$f":"+$N$11-U3","v":1.0586472250070716E-15},{"$f":"+$N$11+U3","v":1.0586472250070716E-15},{"$f":"+$N$12-U3","v":87.340100442375913},{"$f":"+$N$12+U3","v":87.340100442375913}]
[null,null,null,null,null,null,null,null,null,null,null,null,null,null,null,null,null,null,-9,{"$f":"$N$18*S4/10","v":0},{"$f":"+SQRT(($N$18*$N$18)-(T4*T4))","v":0},{"$f":"IF($B$24=\"s\",$N$10+$N$18*S4/10,0)","v":0},{"$f":"+$N$11-U4","v":1.0586472250070716E-15},{"$f":"+$N$11+U4","v":1.0586472250070716E-15},{"$f":"+$N$12-U4","v":87.340100442375913},{"$f":"+$N$12+U4","v":87.340100442375913},null,null,null,"drift"]
[null,null,null,null,null,null,null,null,null,null,null,null,"Ascent Time",{"$f":"MAX(T30:T259)","v":{"$error":"#NUM!"}},null,null,null,null,-8,0,0,0,1.0586472250070716E-15,1.0586472250070716E-15,87.340100442375913,87.340100442375913,null,null,"None",0]
["Shell Diameter",{"$f":"SHELLCALC!C7","v":"1¼\" (30mm)"},null,null,null,null,null,null,null,null,null,null,"Flight Time",{"$f":"MAX(S31:S260)","v":22.800000000000054},null,null,null,null,-7,0,0,0,1.0586472250070716E-15,1.0586472250070716E-15,87.340100442375913,87.340100442375913,null,null,"Minor",2]
["V0=",{"$f":"IF(is_imp,E7*0.305,E7)","v":90},"100-120",null,{"$f":"IF(muzzle_velocity=0,VLOOKUP(SHELLCALC!C7,shell_data1,8),SHELLCALC!C9)","v":90},null,null,null,null,null,null,null,"Max Downrange Carry",{"$f":"MAX(M30:M259)","v":47.974235392591467},null,null,null,null,-6,0,0,0,1.0586472250070716E-15,1.0586472250070716E-15,87.340100442375913,87.340100442375913,null,null,"Typical",4]
["Elevation",{"$f":"90-B11","v":-30},null,null,null,null,null,null,null,null,null,null,"Max Height",{"$f":"MAX(P30:P259)","v":140},null,null,null,null,-5,0,0,0,1.0586472250070716E-15,1.0586472250070716E-15,87.340100442375913,87.340100442375913,null,null,"Major",6]
["Wind Speed (km/h)",{"$f":"IF(is_imp,SHELLCALC!C13/1.944,SHELLCALC!C13)","v":10},null,null,null,null,null,null,null,null,null,null,"Max Crossrange Carry",{"$f":"MAX(O30:O259)","v":1.0586472250070716E-15},null,null,null,null,-4,0,0,0,1.0586472250070716E-15,1.0586472250070716E-15,87.340100442375913,87.340100442375913,null,null,"Extreme",8]
["Relative Wind Direction [degrees]",{"$f":"SHELLCALC!C14","v":180},"0 = tailwind, 180 = headwind, +ve = from right, -ve = from left",null,null,null,null,null,null,null,null,null,"Burst x",{"$f":"IF(is_shell,SUM(U31:U259),MIN(Y31:Y259)+MAX(Y31:Y259))","v":47.441050008873276},null,{"$f":"MAX(Y31:Y259)","v":47.441050008873276},{"$f":"MIN(Y31:Y259)","v":0},null,-3,0,0,0,1.0586472250070716E-15,1.0586472250070716E-15,87.340100442375913,87.340100442375913]
["Mortar Angle from Vertical",{"$f":"+D11+D15","v":120},null,{"$f":"SHELLCALC!C8","v":120},null,null,null,null,null,null,null,null,"Burst y",{"$f":"IF(is_shell,SUM(V31:V259),MIN(Z31:Z259)+MAX(Z31:Z259))","v":1.0586472250070716E-15},null,{"$f":"MAX(Z31:Z259)","v":1.0586472250070716E-15},{"$f":"MIN(Z31:Z259)","v":0},null,-2,0,0,0,1.0586472250070716E-15,1.0586472250070716E-15,87.340100442375913,87.340100442375913]
["Height of Mortar AMSL",{"$f":"IF(is_imp,SHELLCALC!C15*0.305,SHELLCALC!C15)","v":300},null,null,null,null,null,null,null,null,null,null,"Burst z",{"$f":"IF(is_shell,SUM(W31:W259),MAX(AA31:AA259))","v":87.340100442375913},null,{"$f":"MAX(AA31:AA259)","v":87.340100442375913},{"$f":"MIN(Z31:Z259)","v":0},null,-1,0,0,0,1.0586472250070716E-15,1.0586472250070716E-15,87.340100442375913,87.340100442375913]
["Terrain Category",{"$f":"SHELLCALC!C17","v":2},null,null,null,null,null,null,null,null,null,null,"Height all Burnt",null,null,null,null,null,0,0,0,0,1.0586472250070716E-15,1.0586472250070716E-15,87.340100442375913,87.340100442375913]
["Fuse Delay",{"$f":"IF(Fuse_Delay=\"\",D14,Fuse_Delay)","v":3},null,{"$f":"VLOOKUP(B6,AF32:AL46,7,FALSE)","v":3.3},null,null,null,null,null,null,null,null,"Time all burnt",{"$f":"MIN(AB31:AB258)-0.1","v":3.0000000000000013},null,null,null,null,1,0,0,0,1.0586472250070716E-15,1.0586472250070716E-15,87.340100442375913,87.340100442375913]
["drift",{"$f":"+SHELLCALC!C12","v":"None"},null,{"$f":"IF(B15=\"extreme\",AD9,IF(B15=\"major\",AD8,IF(B15=\"typical\",AD7,IF(B15=\"minor\",AD6,AD5))))","v":0},null,null,null,null,null,null,null,null,null,null,null,null,null,null,2,0,0,0,1.0586472250070716E-15,1.0586472250070716E-15,87.340100442375913,87.340100442375913]
["height of launch",{"$f":"+SHELLCALC!C16","v":140},null,null,null,null,null,null,null,null,null,null,"raw diam",{"$f":"2*((B18*0.5))","v":30},null,null,null,null,3,0,0,0,1.0586472250070716E-15,1.0586472250070716E-15,87.340100442375913,87.340100442375913]
["CD",{"$f":"VLOOKUP(B6,AF32:AJ46,5,FALSE)","v":0.61504972114891543},null,null,null,null,null,null,null,null,null,null,"diam",{"$f":"IF(is_imp,N16*N20,N16)","v":30},null,null,null,null,4,0,0,0,1.0586472250070716E-15,1.0586472250070716E-15,87.340100442375913,87.340100442375913]
["Diameter",{"$f":"VLOOKUP(B6,AF32:AG46,2,FALSE)","v":30},null,null,null,null,null,null,null,null,null,null,"rad",{"$f":"IF(B24=\"C\",0,N17/2)","v":0},null,null,null,null,5,0,0,0,1.0586472250070716E-15,1.0586472250070716E-15,87.340100442375913,87.340100442375913]
["Mass",{"$f":"IF(SHELLCALC!C11=\"\",VLOOKUP(B6,AF32:AH46,3,FALSE),IF(is_imp=\"I\",SHELLCALC!C11/2.205,SHELLCALC!C11/1000))","v":1.570703477200033E-2},null,null,null,null,null,null,null,null,null,null,null,null,null,null,null,null,6,0,0,0,1.0586472250070716E-15,1.0586472250070716E-15,87.340100442375913,87.340100442375913]
["Effective area",{"$f":"3.14159265*(B18/2000)^2","v":7.0685834625000001E-4},null,null,null,null,null,null,null,null,null,null,"met_imp",{"$f":"1/(2.54*3)","v":0.13123359580052493},null,null,null,null,7,0,0,0,1.0586472250070716E-15,1.0586472250070716E-15,87.340100442375913,87.340100442375913]
["Grav Constant",9.8049999999999997,null,null,null,null,null,null,null,null,null,null,null,null,null,null,null,null,8,0,0,0,1.0586472250070716E-15,1.0586472250070716E-15,87.340100442375913,87.340100442375913]
["Time increment",0.1,null,null,null,null,null,null,null,null,null,"Max offset",null,null,null,null,null,null,9,0,0,0,1.0586472250070716E-15,1.0586472250070716E-15,87.340100442375913,87.340100442375913]
["Wind Speed [m/s]",{"$f":"B9*1000/3600","v":2.7777777777777777},null,null,null,null,null,null,null,null,null,null,null,null,null,null,null,null,10,0,0,0,1.0586472250070716E-15,1.0586472250070716E-15,87.340100442375913,87.340100442375913]
["Comet?",{"$f":"LEFT(D24,1)","v":"C"},null,{"$f":"SHELLCALC!C6","v":"Comets"},null,null,{"$f":"IF(B24=\"c\",1,0)","v":1},{"$f":"IF(B24=\"s\",1,0)","v":0},null,null,null,null,null,null,"Param 1",0.01]
["Imperial?",{"$f":"LEFT(D25,1)","v":"M"},null,{"$f":"SHELLCALC!C5","v":"Metric"},null,null,{"$f":"IF(B25=\"i\",1,0)","v":0},{"$f":"IF(B25=\"m\",1,0)","v":1},null,null,null,null,null,null,null,null,null,null,null,null,null,50,0,0,0,0]
["Linear Burning Rate",{"$f":"IF(is_comet,IF(SHELLCALC!C10<>\"\",Calculations!B18/(6000*SHELLCALC!C10),0.00143),0)","v":1.6666666666666668E-3}]
["Trajectory Calculations"]
["t","xdot","ydot","zdot","Corrected Wind","wxdot","wydot","rho","V","xdotdot","ydotdot","zdotdot","x","y","ABS y","z","Wind Direction","Wind Direction","Flight Time","Ascent Time","Burst x","Burst y","Burst z","m","x all Burnt","y all Burnt","z all Burnt","Time all burnt","Effective Area"]
[null,null,null,null,null,null,null,null,null,null,null,null,0,0,0,0,0,0]
[null,null,null,null,null,null,null,null,null,null,null,null,{"$f":"IF(X30>0,IF(P29<=2,M29,M29+(B31*$B$22)),M29)","v":0},0,{"$f":"ABS(N30)","v":0},{"$f":"+B16","v":140},0,0,null,null,null,null,null,null,null,null,null,null,null,null,null,null,"Aerial Shell/Comet Data",null,null,null,null,null,null,null,null,"Terrrain Categories",null,"Drift"]
[0,{"$f":"$B$7*COS(RADIANS($B$8))","v":77.94228634059948},0,{"$f":"$B$7*SIN(RADIANS($B$8))","v":-44.999999999999993},{"$f":"IF($B$13=2,$B$23*((0.1036*LN(ABS(P30+1)))+0.8731),IF($B$13=3,$B$23*((0.139*LN(ABS(P30+1)))+0.7503),$B$23))","v":3.8494209017866061},{"$f":"E31*COS(RADIANS($B$10))","v":-3.8494209017866061},{"$f":"E31*SIN(RADIANS($B$10))","v":4.7161120701168077E-16},{"$f":"1.22*EXP(-0.0001065*(P30+$B$12))","v":1.1641495945953624},{"$f":"SQRT(((B31-F31)^2)+((C31-G31)^2)+(D31^2))","v":93.353539695204873},{"$f":"-0.5*H31*I31*AC31*$B$17*(B31-F31)/X31","v":-146.96288713609567},{"$f":"-0.5*H31*I31*AC31*$B$17*(C31-G31)/X31","v":8.4738840800547578E-16},{"$f":"(-0.5*H31*AC31*I31*$B$17*D31/X31)-$B$21","v":71.050751079091611},{"$f":"M30+(B32*B22)","v":6.3245997626989912},{"$f":"N30+(C32*B22)","v":8.473884080054758E-18},{"$f":"ABS(N31)","v":8.473884080054758E-18},{"$f":"P30+(D32*$B$22)","v":136.2105075107909},{"$f":"A32*$B$23*SIN(RADIANS($B$10))","v":3.4031901525239447E-17},{"$f":"A32*$B$23*COS(RADIANS($B$10))","v":-0.27777777777777779},{"$f":"A32","v":0.1},{"$f":"A32","v":0.1},{"$f":"IF(ROUND(A31*10,3)=$B$14*10,M31,0)","v":0},{"$f":"IF(ROUND(A31*10,3)=$B$14*10,N31,0)","v":0},{"$f":"IF(ROUND(A31*10,3)=$B$14*10,P31,0)","v":0},{"$f":"IF($B$24=\"C\",IF((3.14159265*1860/4)*((0.001*$B$18)-(2*$B$26*A31))^2*((0.33333*0.001*$B$18)-(2*$B$26*A31))<0,(3.14159265*1860/4)*((0.001*$B$18)-(2*$B$26*A31))^2*((0.33333*0.001*$B$18)-(2*$B$26*A31)),(3.14159265*1860/4)*((0.001*$B$18)-(2*$B$26*A31))^2*((0.33333*0.001*$B$18)-(2*$B$26*A31))),$B$19)","v":1.3147433764597599E-2},{"$f":"IF(X31<=0,M31,0)","v":0},{"$f":"IF(X31<=0,N31,0)","v":0},{"$f":"IF(X31<=0,P31,0)","v":0},{"$f":"IF(X31<=0,S31,3000)","v":3000},{"$f":"IF($B$24=\"S\",$B$20,3.1415*(($B$18*0.0005)-($B$26*A31))^2)","v":7.0683750000000004E-4},null,null,"Size","Size","Mass","K=CD rho/2g","CD","LOG10(CD)","delay","Vo (m/s)",null,null,2,null,"None"]
[{"$f":"A31+$B$22","v":0.1},{"$f":"B31+(J31*$B$22)","v":63.245997626989912},{"$f":"C31+(K31*$B$22)","v":8.473884080054758E-17},{"$f":"D31+(L31*$B$22)","v":-37.894924892090827},{"$f":"IF($B$13=2,$B$23*((0.1036*LN(ABS(P31+1)))+0.8731),IF($B$13=3,$B$23*((0.139*LN(ABS(P31+1)))+0.7503),$B$23))","v":3.8415808012312862},{"$f":"E32*COS(RADIANS($B$10))","v":-3.8415808012312862},{"$f":"E32*SIN(RADIANS($B$10))","v":4.7065067830351285E-16},{"$f":"1.22*EXP(-0.0001065*(P31+$B$12))","v":1.1646195180145003},{"$f":"SQRT(((B32-F32)^2)+((C32-G32)^2)+(D32^2))","v":77.050428369606962},{"$f":"-0.5*H32*I32*AC32*$B$17*(B32-F32)/X32","v":-102.96353989982201},{"$f":"-0.5*H32*I32*AC32*$B$17*(C32-G32)/X32","v":5.9228324839692315E-16},{"$f":"(-0.5*H32*AC32*I32*$B$17*D32/X32)-$B$21","v":48.354732435449115},{"$f":"IF(X32>0,IF(P31<=Param_1,M31,M31+(B33*$B$22)),M31)","v":11.619564126399762},{"$f":"IF(X32>0,IF(P31<=Param_1,N31,N31+(C33*$B$22)),N31)","v":2.2870600644078748E-17},2.2870600644078748E-17,{"$f":"IF(X32>0,IF(P31<Param_1,P31,P31+(D33*$B$22)),P31)","v":132.90456234593631},{"$f":"IF(P31<Param_1,Q31,A33*$B$23*SIN(RADIANS($B$10)))","v":6.8063803050478895E-17},{"$f":"IF(P31<Param_1,R31,A33*$B$23*COS(RADIANS($B$10)))","v":-0.55555555555555558},{"$f":"IF(P31<Param_1,S31,A33)","v":0.2},{"$f":"IF(D32<0,T31,A33)","v":0.1},{"$f":"IF(ROUND(A32*10,3)=$B$14*10,M32,0)","v":0},{"$f":"IF(ROUND(A32*10,3)=$B$14*10,N32,0)","v":0},{"$f":"IF(ROUND(A32*10,3)=$B$14*10,P32,0)","v":0},1.242832436713295E-2,{"$f":"IF(X32<=0,M32,0)","v":0},{"$f":"IF(X32<=0,N32,0)","v":0},0,{"$f":"IF(X32<=0,S32,3000)","v":3000},{"$f":"IF($B$24=\"S\",$B$20,3.1415*(($B$18*0.0005)-($B$26*A32))^2)","v":6.9121726388888876E-4},null,null,"½\" (13mm)",13,{"$f":"205.25*((AG32/1000)^2.7029)","v":1.6385536009304493E-3},null,{"$f":"(-0.0921*(LN(AG32)))+0.9283","v":0.69206816417779249},{"$f":"AG32^0.2","v":1.6702776523348104},2.2999999999999998,90,null,null,3,null,"Minor"]
[0.2,{"$f":"B32+(J32*$B$22)","v":52.949643637007711},1.439671656402399E-16,{"$f":"D32+(L32*$B$22)","v":-33.059451648545917},3.8345621968328651,{"$f":"E33*COS(RADIANS($B$10))","v":-3.8345621968328651},4.697907950700788E-16,1.165029633127743,{"$f":"SQRT(((B33-F33)^2)+((C33-G33)^2)+(D33^2))","v":65.706722452748465},{"$f":"-0.5*H33*I33*AC33*$B$17*(B33-F33)/X33","v":-77.001057071524514},{"$f":"-0.5*H33*I33*AC33*$B$17*(C33-G33)/X33","v":4.4182644657199066E-16},{"$f":"(-0.5*H33*AC33*I33*$B$17*D33/X33)-$B$21","v":35.024591006200708},16.144517919385287,4.1685581673822646E-17,4.1685581673822646E-17,129.94886309114372,1.0209570457571835E-16,-0.83333333333333348,0.30000000000000004,{"$f":"IF(D33<0,T32,A34)","v":0.1},{"$f":"IF(ROUND(A33*10,3)=$B$14*10,M33,0)","v":0},{"$f":"IF(ROUND(A33*10,3)=$B$14*10,N33,0)","v":0},{"$f":"IF(ROUND(A33*10,3)=$B$14*10,P33,0)","v":0},1.1731614492799681E-2,0,0,0,3000,6.7577155555555558E-4,null,null,"1\" (25mm)",25,{"$f":"205.25*((AG33/1000)^2.7029)","v":9.5956680399203412E-3},null,0.63184153652963881,{"$f":"AG33^0.2","v":1.9036539387158786},3.1,90,null,null,"None",null,"Typical"]
[0.30000000000000004,45.249537929855258,1.8814981029743896E-16,-29.556992547925844,3.8281388713637341,-3.8281388713637341,4.6900384234269071E-16,1.1653964211776116,57.29078607143606,-60.194838203683638,3.4447357983734467E-16,26.447294325506618,20.067523330333977,6.3945298501939994E-17,6.3945298501939994E-17,127.2576367796062,1.3612760610095779E-16,-1.1111111111111112,0.4,0.1,0,0,0,1.1056979510357282E-2,0,0,0,3000,6.6050037499999987E-4,null,null,"1¼\" (30mm)",30,1.570703477200033E-2,null,0.61504972114891543,{"$f":"AG34^0.2","v":1.97435048583482},3.3,90,null,null,null,null,"Major"]
[0.4,39.230054109486893,2.2259716828117343E-16,-26.912263115375183,3.822162918149262,-3.822162918149262,4.6827169935795903E-16,1.1657304898470036,50.771678098974313,-48.609660761327859,2.7738770353394153E-16,20.581262791489337,23.504432133669386,8.8978892365396758E-17,8.8978892365396758E-17,124.77222309598358,1.7015950762619721E-16,-1.3888888888888888,0.5,0.1,0,0,0,1.0404094788565264E-2,0,0,0,3000,6.4540372222222225E-4,null,null,"1½\" (38mm)",38,2.9756390477136296E-2,null,0.59327831468919989,2.0699350540816139,3.6,90,null,null,null,null,"Extreme"]
[0.5,34.369088033354103,2.5033593863456759E-16,-24.85413683622625,3.8165315356743359,-3.8165315356743359,4.6758177140414349E-16,1.1660390955360425,45.561712651572108,-40.248892032368154,2.2898421359428636E-16,16.392073174906375,26.538852016681115,1.1630232836479637E-16,1.1630232836479637E-16,122.45073014411001,2.0419140915143666E-16,-1.6666666666666665,0.6,0.1,0,0,0,9.7726356961831198E-3,0,0,0,3000,6.3048159722222221E-4,null,null,"1¾\" (45mm)",45,4.6994958375691114E-2,null,0.57770638469215352,2.1411273683383238,3.8,90]
[0.6,30.344198830117286,2.7323435999399623E-16,-23.214929518735612,3.8111701241544083,-3.8111701241544083,4.6692491890016668E-16,1.1663274215164992,41.297968242545402,-33.999933928742742,1.928091075300016E-16,13.304282492429778,29.233272560405418,1.4555385543949602E-16,1.4555385543949602E-16,120.26228001716075,2.3822331067667606E-16,-1.9444444444444442,0.7,0.1,0,0,0,9.162277601970352E-3,0,0,0,3000,6.1573399999999994E-4,null,null,"2\" (50mm)",50,{"$f":"205.25*((AG37/1000)^2.7029)","v":6.2478298042624308E-2},3.2000000000000001E-2,{"$f":"(-0.0921*(LN(AG37)))+0.9283","v":0.5680026812000678},{"$f":"AG37^0.2","v":2.1867241478865562},4,93,null,null,null,null,"Metric"]
[0.7,26.94420543724301,2.9251527074699638E-16,-21.884501269492635,3.8060228366932907,-3.8060228366932907,4.662942997721708E-16,1.1665992890577712,37.74265404967722,-29.198197994821378,1.6500802698513859E-16,10.974943335450543,31.635711124181505,1.7645546278404706E-16,1.7645546278404706E-16,118.18357932356599,2.7225521220191553E-16,-2.2222222222222219,0.79999999999999993,0.1,0,0,0,8.5726958746864604E-3,0,0,0,3000,6.0116093055555557E-4,null,null,"2½\" (63mm)",63,0.11668653317987436,3.2000000000000001E-2,0.54671729169933991,2.2901720489235826,4.4000000000000004,100,null,null,null,null,"Imperial"]
[0.79999999999999993,24.024385637760872,3.0901607344551025E-16,-20.787006935947581,3.8010469242637805,-3.8010469242637805,4.656846766296933E-16,1.1668575812923081,34.732612263101011,-25.424721173260249,1.431516129599451E-16,9.1885539796200995,33.783902476224988,2.0878858625819754E-16,2.0878858625819754E-16,116.19676416976743,3.0628711372715495E-16,-2.4999999999999996,0.89999999999999991,0.1,0,0,0,8.0035658830909448E-3,0,0,0,3000,5.8676238888888876E-4,null,null,"3\" (75mm)",75,0.18693312000118675,2.75E-2,0.53065934474330589,2.3714406097793117,4.7,105]
[0.89999999999999991,21.481913520434848,3.2333123474150477E-16,-19.868151537985572,3.7962091724753293,-3.7962091724753293,4.6509198021680804E-16,1.1671045095954795,32.151624102277928,-22.40371928772251,1.2564097366841823E-16,7.8039219611156163,35.708056635391245,2.4237811946903222E-16,2.4237811946903222E-16,114.28798823558003,3.4031901525239438E-16,-2.7777777777777772,0.99999999999999989,0.1,0,0,0,7.4545629959433049E-3,0,0,0,3000,5.7253837499999995E-4,null,null,"4\" (100mm)",100,0.40680208090393727,2.75E-2,0.5041638258704968,2.5118864315095806,5.2,125]
{"$rows_left_out":219}