{"text_format":"1","workbook":"xlsx","n_sheets":5,"sheets":["LargeGraphs","SHELLCALC","Revisions","About","Calculations"],"not_rendered":{"charts":6,"images":0,"macros":1,"external_links":0,"defined_names":18,"comments":0,"pivot_tables":0},"unopened":[],"bounds":{"document_bytes":16777216,"sheet_cells":100000,"rows_first":2000,"rows_last":500,"rows_between":2000,"halvings":0,"cell_chars":16384,"cell_head_chars":4096},"cells_cut":0,"cells_raw":0,"read":"whole","date_system":"1900"}

{"sheet":"LargeGraphs","index":0,"n_rows":0,"n_cols":0,"rows_kept":0,"cut":false,"hidden":false,"merged":[]}

{"sheet":"SHELLCALC","index":1,"n_rows":17,"n_cols":17,"rows_kept":17,"cut":false,"hidden":false,"merged":[[3,1,3,3],[3,5,3,7],[0,1,0,3],[0,5,0,7]]}
[null,"ShellCalc© v4.1.2",null,null,null,"Developed by John Harradine, Manly, Queensland, Australia\nAdditions by Tom Smith, Davas Ltd, UK - effective 21 July 2010.  \nSee http://www.jpyro.com/wp?p=23 for more details",null,null,null,null,null,null,null,null,null,"Size","Terrrain Categories"]
[null,null,null,null,null,null,null,null,null,null,null,null,null,null,null,"½\" (13mm)",2]
[null,null,null,null,null,null,null,null,null,null,null,null,null,null,null,"1\" (25mm)",3]
[null,"Input",null,null,null,"Output",null,null,null,null,null,null,null,null,null,"10\" (250mm)","None"]
[null,"Units","Metric",null,null,"Max Downrange Carry",{"$f":"IF(is_imp,Calculations!N7/0.305,Calculations!N7)","v":47.974235392591467},{"$f":"IF(is_imp,\"ft\",\"m\")","v":"m"},null,null,null,null,null,null,null,"1½\" (38mm)"]
[null,"Type","Comets",null,null,"Max Height (from Ground Level)",{"$f":"IF(is_imp,Calculations!N8/0.305,Calculations!N8)","v":140},{"$f":"IF(is_imp,\"ft\",\"m\")","v":"m"},null,null,null,null,null,null,null,"12\" (300mm)"]
[null,{"$f":"IF(is_shell, \"Shell Diameter\",\"Comet Diameter\")","v":"Comet Diameter"},"1¼\" (30mm)",null,null,"Max Crossrange Carry",{"$f":"IF(is_imp,Calculations!N9/0.305,Calculations!N9)","v":1.0586472250070716E-15},{"$f":"IF(is_imp,\"ft\",\"m\")","v":"m"},null,null,null,null,null,null,null,"2\" (50mm)","Comet Choices"]
[null,{"$f":"IF(is_comet,\"Roman Candle Angle\",\"Mortar Angle\")","v":"Roman Candle Angle"},120,"° from vertical",null,{"$f":"IF(is_shell,\"Approx Burst Diameter\",\"\")","v":""},{"$f":"IF(is_shell,+Calculations!N18*2,0)","v":0},{"$f":"IF(is_shell,IF(is_imp,\"ft\",\"m\"),\"\")","v":""},null,null,null,null,null,null,null,"2½\" (63mm)","C"]
[null,"Muzzle Velocity",null,{"$f":"IF(is_imp,\"ft/s - if known\",\"m/s - if known\")","v":"m/s - if known"},null,"Ascent Time",{"$f":"IF(is_shell,Calculations!N5,\"\")","v":""},"s",null,null,null,null,null,null,null,"3\" (75mm)","S"]
[null,{"$f":"IF(is_shell,\"Fuse Delay\",\"Comet Burning Time\")","v":"Comet Burning Time"},3,"s - if known",null,{"$f":"IF(is_shell,\"Burst Time\",\"Effect Duration\")","v":"Effect Duration"},{"$f":"IF(Fuse_Delay>0,Fuse_Delay,VLOOKUP(C7,shell_data,7))","v":3},"s",null,null,null,null,null,null,null,"4\" (100mm)"]
[null,{"$f":"IF(is_shell,\"Shell Mass\",\"Comet Mass\")","v":"Comet Mass"},null,{"$f":"IF(is_imp,\"lb - if known\",\"g - if known\")","v":"g - if known"},null,"Burst Distance (from firing point)",{"$f":"+Calculations!N10","v":47.441050008873276},"m",null,null,null,null,null,null,null,"5\" (125mm)","Unit Choices"]
[null,"Tumbling/Mortar Drift","None",null,null,"Burst Height (from Ground Level)",{"$f":"IF(is_imp,Calculations!N12/0.305,Calculations!N12)","v":87.340100442375913},"m",null,null,null,null,null,null,null,"6\" (150mm)","I"]
[null,"Wind Speed",10,{"$f":"IF(is_imp,\"kts\",\"km/h\")","v":"km/h"},null,null,null,null,null,null,null,null,null,null,null,"7\" (175mm)","M"]
[null,"Relative Wind Direction",180,"degrees",null,null,null,null,null,null,null,null,null,null,null,"8\" (200mm)"]
[null,"Elevation of Launch Site",300,{"$f":"IF(is_imp,\"ft AMSL\",\"m AMSL\")","v":"m AMSL"},null,{"$f":"IF(is_comet,\"Time at All Burnt\",\"Max Flight Time (if shell does not burst)\")","v":"Time at All Burnt"},{"$f":"IF(is_comet,Calculations!$N$14,Calculations!N6)","v":3.0000000000000013},"s"]
[null,"Height of launch",140,"m from ground level",null,"Muzzle Velocity (Calculated)",{"$f":"+Calculations!B7","v":90},{"$f":"IF(is_imp,\"ft/s\",\"m/s\")","v":"m/s"}]
[null,"Terrain Category",2,"(refer AS1170.2)",null,{"$f":"IF(is_shell,\"Shell Mass\",\"Comet Mass\")","v":"Comet Mass"},{"$f":"IF(C11=\"\",IF(is_imp,Calculations!B19/0.454,Calculations!B19*1000),SHELLCALC!C11)","v":15.70703477200033},{"$f":"IF(is_imp,\"lb\",\"g\")","v":"g"}]

{"sheet":"Revisions","index":2,"n_rows":8,"n_cols":11,"rows_kept":8,"cut":false,"hidden":true,"merged":[]}
["Revision Log"]
[null,null,null,null,null,null,null,null,"Current Version",null,{"$f":"+version","v":"ShellCalc© v4.1.2"}]
[]
[3.1,2000,"JH","original progam"]
[3.2,2005,"TS","incorporates shell bursts"]
[4.0999999999999996,"2010-07-21","TS","allows firing above ground level"]
["4.1.1","2010-07-22","TS","more diameters"]
["4.1.2","2010-07-23","TS","Shell data inc Vo from Russell's book"]

{"sheet":"About","index":3,"n_rows":12,"n_cols":2,"rows_kept":12,"cut":false,"hidden":false,"merged":[]}
[]
[null,{"$f":"+\"About \"&version","v":"About ShellCalc© v4.1.2"}]
[]
[null,"SHELLCALC© is a freeware program designed to assist:"]
[null,"M fireworks operators to plan a display, especially where a risk or hazard assessment is required;"]
[null,"M   fireworks regulators to develop safe distances and establish risk regimes for fireworks displays;"]
[null,"M   enforcement and investigative agencies to predict possible outcomes of \"near misses\", or to confirm actual incident data, particularly for presentation in court or in investigation reports;"]
[null,"M    fireworks testers, to establish a safe template for test firings; and"]
[null,"M    fireworks manufacturers, to establish safe distances for their products and predict the effect of variable fuse delay times on burst height."]
[null,"SHELLCALC© is a freeware program and is designed to run on Microsoft® Excel 2007 or later - limited functionality may be available in previous versions of Excel."]
[null,"Copies of this program and updates may be obtained directly from the Journal of Pyrotechnics Web-site - click link below"]
[null,"http://www.jpyro.com/wp/?p=23"]

{"sheet":"Calculations","index":4,"n_rows":259,"n_cols":44,"rows_kept":259,"cut":false,"hidden":true,"merged":[]}
["SHELLCALC v4.1 ",null,null,null,null,null,null,null,null,null,null,null,null,null,null,null,null,null,"Burst Calculations"]
["2010-07-21",null,null,null,null,null,null,null,null,null,null,null,null,null,null,null,null,null,"Inc","cos",null,"x val","y1 val","y2 val","z1 val","z2 val"]
[null,null,null,null,null,null,null,null,null,null,null,null,null,null,null,null,null,null,-10,{"$f":"$N$18*S3/10","v":0},{"$f":"+SQRT(($N$18*$N$18)-(T3*T3))","v":0},{"$f":"IF($B$24=\"s\",$N$10+$N$18*S3/10,0)","v":0},{"$f":"+$N$11-U3","v":1.0586472250070716E-15},{"$f":"+$N$11+U3","v":1.0586472250070716E-15},{"$f":"+$N$12-U3","v":87.340100442375913},{"$f":"+$N$12+U3","v":87.340100442375913}]
[null,null,null,null,null,null,null,null,null,null,null,null,null,null,null,null,null,null,-9,{"$f":"$N$18*S4/10","v":0},{"$f":"+SQRT(($N$18*$N$18)-(T4*T4))","v":0},{"$f":"IF($B$24=\"s\",$N$10+$N$18*S4/10,0)","v":0},{"$f":"+$N$11-U4","v":1.0586472250070716E-15},{"$f":"+$N$11+U4","v":1.0586472250070716E-15},{"$f":"+$N$12-U4","v":87.340100442375913},{"$f":"+$N$12+U4","v":87.340100442375913},null,null,null,"drift"]
[null,null,null,null,null,null,null,null,null,null,null,null,"Ascent Time",{"$f":"MAX(T30:T259)","v":{"$error":"#NUM!"}},null,null,null,null,-8,0,0,0,1.0586472250070716E-15,1.0586472250070716E-15,87.340100442375913,87.340100442375913,null,null,"None",0]
["Shell Diameter",{"$f":"SHELLCALC!C7","v":"1¼\" (30mm)"},null,null,null,null,null,null,null,null,null,null,"Flight Time",{"$f":"MAX(S31:S260)","v":22.800000000000054},null,null,null,null,-7,0,0,0,1.0586472250070716E-15,1.0586472250070716E-15,87.340100442375913,87.340100442375913,null,null,"Minor",2]
["V0=",{"$f":"IF(is_imp,E7*0.305,E7)","v":90},"100-120",null,{"$f":"IF(muzzle_velocity=0,VLOOKUP(SHELLCALC!C7,shell_data1,8),SHELLCALC!C9)","v":90},null,null,null,null,null,null,null,"Max Downrange Carry",{"$f":"MAX(M30:M259)","v":47.974235392591467},null,null,null,null,-6,0,0,0,1.0586472250070716E-15,1.0586472250070716E-15,87.340100442375913,87.340100442375913,null,null,"Typical",4]
["Elevation",{"$f":"90-B11","v":-30},null,null,null,null,null,null,null,null,null,null,"Max Height",{"$f":"MAX(P30:P259)","v":140},null,null,null,null,-5,0,0,0,1.0586472250070716E-15,1.0586472250070716E-15,87.340100442375913,87.340100442375913,null,null,"Major",6]
["Wind Speed (km/h)",{"$f":"IF(is_imp,SHELLCALC!C13/1.944,SHELLCALC!C13)","v":10},null,null,null,null,null,null,null,null,null,null,"Max Crossrange Carry",{"$f":"MAX(O30:O259)","v":1.0586472250070716E-15},null,null,null,null,-4,0,0,0,1.0586472250070716E-15,1.0586472250070716E-15,87.340100442375913,87.340100442375913,null,null,"Extreme",8]
["Relative Wind Direction [degrees]",{"$f":"SHELLCALC!C14","v":180},"0 = tailwind, 180 = headwind, +ve = from right, -ve = from left",null,null,null,null,null,null,null,null,null,"Burst x",{"$f":"IF(is_shell,SUM(U31:U259),MIN(Y31:Y259)+MAX(Y31:Y259))","v":47.441050008873276},null,{"$f":"MAX(Y31:Y259)","v":47.441050008873276},{"$f":"MIN(Y31:Y259)","v":0},null,-3,0,0,0,1.0586472250070716E-15,1.0586472250070716E-15,87.340100442375913,87.340100442375913]
["Mortar Angle from Vertical",{"$f":"+D11+D15","v":120},null,{"$f":"SHELLCALC!C8","v":120},null,null,null,null,null,null,null,null,"Burst y",{"$f":"IF(is_shell,SUM(V31:V259),MIN(Z31:Z259)+MAX(Z31:Z259))","v":1.0586472250070716E-15},null,{"$f":"MAX(Z31:Z259)","v":1.0586472250070716E-15},{"$f":"MIN(Z31:Z259)","v":0},null,-2,0,0,0,1.0586472250070716E-15,1.0586472250070716E-15,87.340100442375913,87.340100442375913]
["Height of Mortar AMSL",{"$f":"IF(is_imp,SHELLCALC!C15*0.305,SHELLCALC!C15)","v":300},null,null,null,null,null,null,null,null,null,null,"Burst z",{"$f":"IF(is_shell,SUM(W31:W259),MAX(AA31:AA259))","v":87.340100442375913},null,{"$f":"MAX(AA31:AA259)","v":87.340100442375913},{"$f":"MIN(Z31:Z259)","v":0},null,-1,0,0,0,1.0586472250070716E-15,1.0586472250070716E-15,87.340100442375913,87.340100442375913]
["Terrain Category",{"$f":"SHELLCALC!C17","v":2},null,null,null,null,null,null,null,null,null,null,"Height all Burnt",null,null,null,null,null,0,0,0,0,1.0586472250070716E-15,1.0586472250070716E-15,87.340100442375913,87.340100442375913]
["Fuse Delay",{"$f":"IF(Fuse_Delay=\"\",D14,Fuse_Delay)","v":3},null,{"$f":"VLOOKUP(B6,AF32:AL46,7,FALSE)","v":3.3},null,null,null,null,null,null,null,null,"Time all burnt",{"$f":"MIN(AB31:AB258)-0.1","v":3.0000000000000013},null,null,null,null,1,0,0,0,1.0586472250070716E-15,1.0586472250070716E-15,87.340100442375913,87.340100442375913]
["drift",{"$f":"+SHELLCALC!C12","v":"None"},null,{"$f":"IF(B15=\"extreme\",AD9,IF(B15=\"major\",AD8,IF(B15=\"typical\",AD7,IF(B15=\"minor\",AD6,AD5))))","v":0},null,null,null,null,null,null,null,null,null,null,null,null,null,null,2,0,0,0,1.0586472250070716E-15,1.0586472250070716E-15,87.340100442375913,87.340100442375913]
["height of launch",{"$f":"+SHELLCALC!C16","v":140},null,null,null,null,null,null,null,null,null,null,"raw diam",{"$f":"2*((B18*0.5))","v":30},null,null,null,null,3,0,0,0,1.0586472250070716E-15,1.0586472250070716E-15,87.340100442375913,87.340100442375913]
["CD",{"$f":"VLOOKUP(B6,AF32:AJ46,5,FALSE)","v":0.61504972114891543},null,null,null,null,null,null,null,null,null,null,"diam",{"$f":"IF(is_imp,N16*N20,N16)","v":30},null,null,null,null,4,0,0,0,1.0586472250070716E-15,1.0586472250070716E-15,87.340100442375913,87.340100442375913]
["Diameter",{"$f":"VLOOKUP(B6,AF32:AG46,2,FALSE)","v":30},null,null,null,null,null,null,null,null,null,null,"rad",{"$f":"IF(B24=\"C\",0,N17/2)","v":0},null,null,null,null,5,0,0,0,1.0586472250070716E-15,1.0586472250070716E-15,87.340100442375913,87.340100442375913]
["Mass",{"$f":"IF(SHELLCALC!C11=\"\",VLOOKUP(B6,AF32:AH46,3,FALSE),IF(is_imp=\"I\",SHELLCALC!C11/2.205,SHELLCALC!C11/1000))","v":1.570703477200033E-2},null,null,null,null,null,null,null,null,null,null,null,null,null,null,null,null,6,0,0,0,1.0586472250070716E-15,1.0586472250070716E-15,87.340100442375913,87.340100442375913]
["Effective area",{"$f":"3.14159265*(B18/2000)^2","v":7.0685834625000001E-4},null,null,null,null,null,null,null,null,null,null,"met_imp",{"$f":"1/(2.54*3)","v":0.13123359580052493},null,null,null,null,7,0,0,0,1.0586472250070716E-15,1.0586472250070716E-15,87.340100442375913,87.340100442375913]
["Grav Constant",9.8049999999999997,null,null,null,null,null,null,null,null,null,null,null,null,null,null,null,null,8,0,0,0,1.0586472250070716E-15,1.0586472250070716E-15,87.340100442375913,87.340100442375913]
["Time increment",0.1,null,null,null,null,null,null,null,null,null,"Max offset",null,null,null,null,null,null,9,0,0,0,1.0586472250070716E-15,1.0586472250070716E-15,87.340100442375913,87.340100442375913]
["Wind Speed [m/s]",{"$f":"B9*1000/3600","v":2.7777777777777777},null,null,null,null,null,null,null,null,null,null,null,null,null,null,null,null,10,0,0,0,1.0586472250070716E-15,1.0586472250070716E-15,87.340100442375913,87.340100442375913]
["Comet?",{"$f":"LEFT(D24,1)","v":"C"},null,{"$f":"SHELLCALC!C6","v":"Comets"},null,null,{"$f":"IF(B24=\"c\",1,0)","v":1},{"$f":"IF(B24=\"s\",1,0)","v":0},null,null,null,null,null,null,"Param 1",0.01]
["Imperial?",{"$f":"LEFT(D25,1)","v":"M"},null,{"$f":"SHELLCALC!C5","v":"Metric"},null,null,{"$f":"IF(B25=\"i\",1,0)","v":0},{"$f":"IF(B25=\"m\",1,0)","v":1},null,null,null,null,null,null,null,null,null,null,null,null,null,50,0,0,0,0]
["Linear Burning Rate",{"$f":"IF(is_comet,IF(SHELLCALC!C10<>\"\",Calculations!B18/(6000*SHELLCALC!C10),0.00143),0)","v":1.6666666666666668E-3}]
["Trajectory Calculations"]
["t","xdot","ydot","zdot","Corrected Wind","wxdot","wydot","rho","V","xdotdot","ydotdot","zdotdot","x","y","ABS y","z","Wind Direction","Wind Direction","Flight Time","Ascent Time","Burst x","Burst y","Burst z","m","x all Burnt","y all Burnt","z all Burnt","Time all burnt","Effective Area"]
[null,null,null,null,null,null,null,null,null,null,null,null,0,0,0,0,0,0]
[null,null,null,null,null,null,null,null,null,null,null,null,{"$f":"IF(X30>0,IF(P29<=2,M29,M29+(B31*$B$22)),M29)","v":0},0,{"$f":"ABS(N30)","v":0},{"$f":"+B16","v":140},0,0,null,null,null,null,null,null,null,null,null,null,null,null,null,null,"Aerial Shell/Comet Data",null,null,null,null,null,null,null,null,"Terrrain Categories",null,"Drift"]
[0,{"$f":"$B$7*COS(RADIANS($B$8))","v":77.94228634059948},0,{"$f":"$B$7*SIN(RADIANS($B$8))","v":-44.999999999999993},{"$f":"IF($B$13=2,$B$23*((0.1036*LN(ABS(P30+1)))+0.8731),IF($B$13=3,$B$23*((0.139*LN(ABS(P30+1)))+0.7503),$B$23))","v":3.8494209017866061},{"$f":"E31*COS(RADIANS($B$10))","v":-3.8494209017866061},{"$f":"E31*SIN(RADIANS($B$10))","v":4.7161120701168077E-16},{"$f":"1.22*EXP(-0.0001065*(P30+$B$12))","v":1.1641495945953624},{"$f":"SQRT(((B31-F31)^2)+((C31-G31)^2)+(D31^2))","v":93.353539695204873},{"$f":"-0.5*H31*I31*AC31*$B$17*(B31-F31)/X31","v":-146.96288713609567},{"$f":"-0.5*H31*I31*AC31*$B$17*(C31-G31)/X31","v":8.4738840800547578E-16},{"$f":"(-0.5*H31*AC31*I31*$B$17*D31/X31)-$B$21","v":71.050751079091611},{"$f":"M30+(B32*B22)","v":6.3245997626989912},{"$f":"N30+(C32*B22)","v":8.473884080054758E-18},{"$f":"ABS(N31)","v":8.473884080054758E-18},{"$f":"P30+(D32*$B$22)","v":136.2105075107909},{"$f":"A32*$B$23*SIN(RADIANS($B$10))","v":3.4031901525239447E-17},{"$f":"A32*$B$23*COS(RADIANS($B$10))","v":-0.27777777777777779},{"$f":"A32","v":0.1},{"$f":"A32","v":0.1},{"$f":"IF(ROUND(A31*10,3)=$B$14*10,M31,0)","v":0},{"$f":"IF(ROUND(A31*10,3)=$B$14*10,N31,0)","v":0},{"$f":"IF(ROUND(A31*10,3)=$B$14*10,P31,0)","v":0},{"$f":"IF($B$24=\"C\",IF((3.14159265*1860/4)*((0.001*$B$18)-(2*$B$26*A31))^2*((0.33333*0.001*$B$18)-(2*$B$26*A31))<0,(3.14159265*1860/4)*((0.001*$B$18)-(2*$B$26*A31))^2*((0.33333*0.001*$B$18)-(2*$B$26*A31)),(3.14159265*1860/4)*((0.001*$B$18)-(2*$B$26*A31))^2*((0.33333*0.001*$B$18)-(2*$B$26*A31))),$B$19)","v":1.3147433764597599E-2},{"$f":"IF(X31<=0,M31,0)","v":0},{"$f":"IF(X31<=0,N31,0)","v":0},{"$f":"IF(X31<=0,P31,0)","v":0},{"$f":"IF(X31<=0,S31,3000)","v":3000},{"$f":"IF($B$24=\"S\",$B$20,3.1415*(($B$18*0.0005)-($B$26*A31))^2)","v":7.0683750000000004E-4},null,null,"Size","Size","Mass","K=CD rho/2g","CD","LOG10(CD)","delay","Vo (m/s)",null,null,2,null,"None"]
[{"$f":"A31+$B$22","v":0.1},{"$f":"B31+(J31*$B$22)","v":63.245997626989912},{"$f":"C31+(K31*$B$22)","v":8.473884080054758E-17},{"$f":"D31+(L31*$B$22)","v":-37.894924892090827},{"$f":"IF($B$13=2,$B$23*((0.1036*LN(ABS(P31+1)))+0.8731),IF($B$13=3,$B$23*((0.139*LN(ABS(P31+1)))+0.7503),$B$23))","v":3.8415808012312862},{"$f":"E32*COS(RADIANS($B$10))","v":-3.8415808012312862},{"$f":"E32*SIN(RADIANS($B$10))","v":4.7065067830351285E-16},{"$f":"1.22*EXP(-0.0001065*(P31+$B$12))","v":1.1646195180145003},{"$f":"SQRT(((B32-F32)^2)+((C32-G32)^2)+(D32^2))","v":77.050428369606962},{"$f":"-0.5*H32*I32*AC32*$B$17*(B32-F32)/X32","v":-102.96353989982201},{"$f":"-0.5*H32*I32*AC32*$B$17*(C32-G32)/X32","v":5.9228324839692315E-16},{"$f":"(-0.5*H32*AC32*I32*$B$17*D32/X32)-$B$21","v":48.354732435449115},{"$f":"IF(X32>0,IF(P31<=Param_1,M31,M31+(B33*$B$22)),M31)","v":11.619564126399762},{"$f":"IF(X32>0,IF(P31<=Param_1,N31,N31+(C33*$B$22)),N31)","v":2.2870600644078748E-17},2.2870600644078748E-17,{"$f":"IF(X32>0,IF(P31<Param_1,P31,P31+(D33*$B$22)),P31)","v":132.90456234593631},{"$f":"IF(P31<Param_1,Q31,A33*$B$23*SIN(RADIANS($B$10)))","v":6.8063803050478895E-17},{"$f":"IF(P31<Param_1,R31,A33*$B$23*COS(RADIANS($B$10)))","v":-0.55555555555555558},{"$f":"IF(P31<Param_1,S31,A33)","v":0.2},{"$f":"IF(D32<0,T31,A33)","v":0.1},{"$f":"IF(ROUND(A32*10,3)=$B$14*10,M32,0)","v":0},{"$f":"IF(ROUND(A32*10,3)=$B$14*10,N32,0)","v":0},{"$f":"IF(ROUND(A32*10,3)=$B$14*10,P32,0)","v":0},1.242832436713295E-2,{"$f":"IF(X32<=0,M32,0)","v":0},{"$f":"IF(X32<=0,N32,0)","v":0},0,{"$f":"IF(X32<=0,S32,3000)","v":3000},{"$f":"IF($B$24=\"S\",$B$20,3.1415*(($B$18*0.0005)-($B$26*A32))^2)","v":6.9121726388888876E-4},null,null,"½\" (13mm)",13,{"$f":"205.25*((AG32/1000)^2.7029)","v":1.6385536009304493E-3},null,{"$f":"(-0.0921*(LN(AG32)))+0.9283","v":0.69206816417779249},{"$f":"AG32^0.2","v":1.6702776523348104},2.2999999999999998,90,null,null,3,null,"Minor"]
[0.2,{"$f":"B32+(J32*$B$22)","v":52.949643637007711},1.439671656402399E-16,{"$f":"D32+(L32*$B$22)","v":-33.059451648545917},3.8345621968328651,{"$f":"E33*COS(RADIANS($B$10))","v":-3.8345621968328651},4.697907950700788E-16,1.165029633127743,{"$f":"SQRT(((B33-F33)^2)+((C33-G33)^2)+(D33^2))","v":65.706722452748465},{"$f":"-0.5*H33*I33*AC33*$B$17*(B33-F33)/X33","v":-77.001057071524514},{"$f":"-0.5*H33*I33*AC33*$B$17*(C33-G33)/X33","v":4.4182644657199066E-16},{"$f":"(-0.5*H33*AC33*I33*$B$17*D33/X33)-$B$21","v":35.024591006200708},16.144517919385287,4.1685581673822646E-17,4.1685581673822646E-17,129.94886309114372,1.0209570457571835E-16,-0.83333333333333348,0.30000000000000004,{"$f":"IF(D33<0,T32,A34)","v":0.1},{"$f":"IF(ROUND(A33*10,3)=$B$14*10,M33,0)","v":0},{"$f":"IF(ROUND(A33*10,3)=$B$14*10,N33,0)","v":0},{"$f":"IF(ROUND(A33*10,3)=$B$14*10,P33,0)","v":0},1.1731614492799681E-2,0,0,0,3000,6.7577155555555558E-4,null,null,"1\" (25mm)",25,{"$f":"205.25*((AG33/1000)^2.7029)","v":9.5956680399203412E-3},null,0.63184153652963881,{"$f":"AG33^0.2","v":1.9036539387158786},3.1,90,null,null,"None",null,"Typical"]
[0.30000000000000004,45.249537929855258,1.8814981029743896E-16,-29.556992547925844,3.8281388713637341,-3.8281388713637341,4.6900384234269071E-16,1.1653964211776116,57.29078607143606,-60.194838203683638,3.4447357983734467E-16,26.447294325506618,20.067523330333977,6.3945298501939994E-17,6.3945298501939994E-17,127.2576367796062,1.3612760610095779E-16,-1.1111111111111112,0.4,0.1,0,0,0,1.1056979510357282E-2,0,0,0,3000,6.6050037499999987E-4,null,null,"1¼\" (30mm)",30,1.570703477200033E-2,null,0.61504972114891543,{"$f":"AG34^0.2","v":1.97435048583482},3.3,90,null,null,null,null,"Major"]
[0.4,39.230054109486893,2.2259716828117343E-16,-26.912263115375183,3.822162918149262,-3.822162918149262,4.6827169935795903E-16,1.1657304898470036,50.771678098974313,-48.609660761327859,2.7738770353394153E-16,20.581262791489337,23.504432133669386,8.8978892365396758E-17,8.8978892365396758E-17,124.77222309598358,1.7015950762619721E-16,-1.3888888888888888,0.5,0.1,0,0,0,1.0404094788565264E-2,0,0,0,3000,6.4540372222222225E-4,null,null,"1½\" (38mm)",38,2.9756390477136296E-2,null,0.59327831468919989,2.0699350540816139,3.6,90,null,null,null,null,"Extreme"]
[0.5,34.369088033354103,2.5033593863456759E-16,-24.85413683622625,3.8165315356743359,-3.8165315356743359,4.6758177140414349E-16,1.1660390955360425,45.561712651572108,-40.248892032368154,2.2898421359428636E-16,16.392073174906375,26.538852016681115,1.1630232836479637E-16,1.1630232836479637E-16,122.45073014411001,2.0419140915143666E-16,-1.6666666666666665,0.6,0.1,0,0,0,9.7726356961831198E-3,0,0,0,3000,6.3048159722222221E-4,null,null,"1¾\" (45mm)",45,4.6994958375691114E-2,null,0.57770638469215352,2.1411273683383238,3.8,90]
[0.6,30.344198830117286,2.7323435999399623E-16,-23.214929518735612,3.8111701241544083,-3.8111701241544083,4.6692491890016668E-16,1.1663274215164992,41.297968242545402,-33.999933928742742,1.928091075300016E-16,13.304282492429778,29.233272560405418,1.4555385543949602E-16,1.4555385543949602E-16,120.26228001716075,2.3822331067667606E-16,-1.9444444444444442,0.7,0.1,0,0,0,9.162277601970352E-3,0,0,0,3000,6.1573399999999994E-4,null,null,"2\" (50mm)",50,{"$f":"205.25*((AG37/1000)^2.7029)","v":6.2478298042624308E-2},3.2000000000000001E-2,{"$f":"(-0.0921*(LN(AG37)))+0.9283","v":0.5680026812000678},{"$f":"AG37^0.2","v":2.1867241478865562},4,93,null,null,null,null,"Metric"]
[0.7,26.94420543724301,2.9251527074699638E-16,-21.884501269492635,3.8060228366932907,-3.8060228366932907,4.662942997721708E-16,1.1665992890577712,37.74265404967722,-29.198197994821378,1.6500802698513859E-16,10.974943335450543,31.635711124181505,1.7645546278404706E-16,1.7645546278404706E-16,118.18357932356599,2.7225521220191553E-16,-2.2222222222222219,0.79999999999999993,0.1,0,0,0,8.5726958746864604E-3,0,0,0,3000,6.0116093055555557E-4,null,null,"2½\" (63mm)",63,0.11668653317987436,3.2000000000000001E-2,0.54671729169933991,2.2901720489235826,4.4000000000000004,100,null,null,null,null,"Imperial"]
[0.79999999999999993,24.024385637760872,3.0901607344551025E-16,-20.787006935947581,3.8010469242637805,-3.8010469242637805,4.656846766296933E-16,1.1668575812923081,34.732612263101011,-25.424721173260249,1.431516129599451E-16,9.1885539796200995,33.783902476224988,2.0878858625819754E-16,2.0878858625819754E-16,116.19676416976743,3.0628711372715495E-16,-2.4999999999999996,0.89999999999999991,0.1,0,0,0,8.0035658830909448E-3,0,0,0,3000,5.8676238888888876E-4,null,null,"3\" (75mm)",75,0.18693312000118675,2.75E-2,0.53065934474330589,2.3714406097793117,4.7,105]
[0.89999999999999991,21.481913520434848,3.2333123474150477E-16,-19.868151537985572,3.7962091724753293,-3.7962091724753293,4.6509198021680804E-16,1.1671045095954795,32.151624102277928,-22.40371928772251,1.2564097366841823E-16,7.8039219611156163,35.708056635391245,2.4237811946903222E-16,2.4237811946903222E-16,114.28798823558003,3.4031901525239438E-16,-2.7777777777777772,0.99999999999999989,0.1,0,0,0,7.4545629959433049E-3,0,0,0,3000,5.7253837499999995E-4,null,null,"4\" (100mm)",100,0.40680208090393727,2.75E-2,0.5041638258704968,2.5118864315095806,5.2,125]
[0.99999999999999989,19.241541591662596,3.3589533210834658E-16,-19.087759341874012,3.7914835667383406,-3.7914835667383406,4.6451302336009019E-16,1.1673417881287662,29.914257547878886,-19.947087572810645,1.1138564444607954E-16,6.7254038241900069,37.432739918829398,2.770815091243277E-16,2.770815091243277E-16,112.44646633963453,3.743509167776338E-16,-3.0555555555555549,1.0999999999999999,0.1,0,0,0,6.9253625820030413E-3,0,0,0,3000,5.5848888888888882E-4,null,null,"5\" (125mm)",125,0.74356893933229817,2.75E-2,0.48361230479445805,2.6265278044037674,5.6,128,null,null,null,null,"Shells"]
[1.0999999999999999,17.246832834381532,3.4703389655295452E-16,-18.415218959455011,3.7868497171478097,-3.7868497171478097,4.6394530799347838E-16,1.167570752082274,27.955967001754406,-17.922642024417236,9.9619330599125869E-17,5.8864689761530027,38.978196782023382,3.127810920856144E-16,3.127810920856144E-16,110.66380913345056,4.0838281830287332E-16,-3.333333333333333,1.2,0.1,0,0,0,6.4156400100296527E-3,0,0,0,3000,5.4461393055555557E-4,null,null,"6\" (150mm)",150,1.2171391441307893,2.9499999999999998E-2,0.46682048941373488,2.7240699274266613,5.9,130,null,null,null,null,"Comets"]
[1.2,15.454568631939809,3.569958296128671E-16,-17.826572061839709,3.7822917745797522,-3.7822917745797522,4.6338689236399662E-16,1.1677924399268484,26.226770098048366,-16.235105980781618,8.9789609253866941E-17,5.2398815753698731,40.361302585409547,3.4937857113943979E-16,3.4937857113943979E-16,108.93355074302028,4.4241471982811279E-16,-3.6111111111111112,1.3,0.1,0,0,0,5.9250706487826406E-3,0,0,0,3000,5.309135E-4,null,null,"7\" (175mm)",175,1.846250847107942,2.75E-2,0.45262321180164433,2.8093613917206541,6.2,130]
[1.3,13.831058033861646,3.6597479053825378E-16,-17.302583904302722,3.7777976774093096,-3.7777976774093096,4.6283629874353885E-16,1.1680076518091422,24.687065626068144,-14.814287530286919,8.1489351534175838E-17,4.7516218031525987,41.596265513492845,3.8679094370860694E-16,3.8679094370860694E-16,107.25080857062153,4.7644662135335231E-16,-3.8888888888888893,1.4000000000000001,0.1,0,0,0,5.453329867021503E-3,0,0,0,3000,5.1738759722222221E-4,null,null,"8\" (200mm)",200,2.6487266492898556,2.75E-2,0.44032497054092584,2.8853998118144268,6.5,132]
[1.4000000000000001,12.349629280832954,3.7412372569167134E-16,-16.827421723987463,3.7733586295658665,-3.7733586295658665,4.622924494828729E-16,1.1682169916022929,23.304781934954715,-13.607488741867288,7.4412690937997753E-17,4.3970172027870937,42.695153554157471,4.2494744318715405E-16,4.2494744318715405E-16,105.61203657025065,5.1047852287859174E-16,-4.166666666666667,1.5000000000000002,0.1,0,0,0,5.0000930335057448E-3,0,0,0,3000,5.0403622222222231E-4,null,null,"10\" (250mm)",250,4.8414473712063772,2.35E-2,0.41977344946488715,3.0170881682725814,6.9,134]
[1.5000000000000002,10.988880406646224,3.8156499478547112E-16,-16.387720003708754,3.7689687471806583,-3.7689687471806583,4.6175462372072608E-16,1.1684208973935792,22.053377940058635,-12.574498185038289,6.832596898063441E-17,4.1582376842743205,43.668296612971709,4.637872023555075E-16,4.637872023555075E-16,104.01484694672251,5.4451042440383126E-16,-4.4444444444444455,1.6000000000000003,0.1,0,0,0,4.5650355169948587E-3,0,0,0,3000,4.9085937499999998E-4,null,null,"12\" (300mm)",300,7.924907561410329,2.6499999999999999E-2,0.40298163408416388,3.1291346445318982,7.3,136]
[1.6000000000000003,9.7314305881423948,3.8839759168353458E-16,-15.971896235281323,3.7646248339671393,-3.7646248339671393,4.6122242986454606E-16,1.1686196635048161,20.910403661987157,-11.684212925050325,6.3048119537602687E-17,4.0226726490107083,44.524597542535446,5.0325744271923695E-16,5.0325744271923695E-16,102.45788404968449,5.7854232592907068E-16,-4.7222222222222232,1.7000000000000004,0.1,0,0,0,4.1478326862483495E-3,0,0,0,3000,4.7785705555555542E-4]
[1.7000000000000004,8.5630092956373627,3.9470240363729485E-16,-15.569628970380252,3.7603262607076777,-3.7603262607076777,4.60695790825832E-16,1.1688134560505294,19.856433353187626,-10.912320729166311,5.843718234504994E-17,3.9819154160482348,45.271775264807516,5.4331205490641691E-16,5.4331205490641691E-16,100.94074030680696,6.125742274543101E-16,-5.0000000000000009,1.8000000000000005,0.1,0,0,0,3.7481599100257184E-3,0,0,0,3000,4.6502926388888887E-4]
[1.8000000000000005,7.471777222720732,4.0054612187179982E-16,-15.171437428775429,3.7560749353004694,-3.7560749353004694,4.6017494035043651E-16,1.1690023232875899,18.874246415092426,-10.239695085705581,5.4380919070610122E-17,4.0312075930558464,45.916556036222531,5.8391047628430299E-16,5.8391047628430299E-16,99.46390863985998,6.4660612897954963E-16,-5.2777777777777795,1.9000000000000006,0.1,0,0,0,3.3656925570864612E-3,0,0,0,3000,4.5237599999999994E-4]
[1.9000000000000006,6.4478077141501737,4.0598421377886084E-16,-14.768316669469844,3.7518753590580816,-3.7518753590580816,4.5966042991597328E-16,1.1691862014403254,17.948167372844278,-9.6512899145669859,5.079027649564828E-17,4.1692877013092016,46.46482390849188,6.2501680042714553E-16,6.2501680042714553E-16,98.028769849926093,6.8063803050478895E-16,-5.5555555555555562,2.0000000000000004,0.1,0,0,0,3.00010599619008E-3,0,0,0,3000,4.3989726388888879E-4,null,null,null,"= new or estimated values",null,null,null,null,null,null,{"$f":"190*0.305","v":57.949999999999996}]
[2.0000000000000004,5.4826787226934748,4.1106324142842567E-16,-14.351387899338924,3.7477347742529461,-3.7477347742529461,4.5915314680833031E-16,1.1693649161836535,17.063495185978233,-9.1354085060710943,4.7594935027457856E-17,4.3986747468484086,46.921737695700514,6.665990739202627E-16,6.665990739202627E-16,96.637617807460686,7.1466993203002857E-16,-5.8333333333333348,2.1000000000000005,0.1,0,0,0,2.6510755960960758E-3,0,0,0,3000,4.2759305555555547E-4]
[2.1000000000000005,4.5691378720863653,4.1582273493117146E-16,-13.911520424654084,3.7436634194517544,-3.7436634194517544,4.5865434540392378E-16,1.1695381794261763,16.205957726656131,-8.6832879840448278,4.4740538780101455E-17,4.7265320199169256,47.291818603068705,7.0862875280118085E-16,7.0862875280118085E-16,95.293731085194452,7.4870183355526799E-16,-6.1111111111111125,2.2000000000000006,0.1,0,0,0,2.3182767255639477E-3,0,0,0,3000,4.1546337499999989E-4]
[2.2000000000000006,3.7008090736818824,4.2029678880918161E-16,-13.438867222662392,3.7396749263335733,-3.7396749263335733,4.581656957858085E-16,1.1697055803128771,15.361118266025933,-8.2890090485302874,4.2187539491592212E-17,5.166457772157603,47.579009419951589,7.5108030707701496E-16,7.5108030707701496E-16,94.001508940649785,7.8273373508050751E-16,-6.3888888888888911,2.3000000000000007,0.1,0,0,0,2.0013847533531942E-3,0,0,0,3000,4.0350822222222203E-4]
[2.3000000000000007,2.8719081688288535,4.2451554275834081E-16,-12.922221445446631,3.7357869208228753,-3.7357869208228753,4.5768935739139768E-16,1.1698665682121294,14.513629507568684,-7.949845027343458,3.9912054312500225E-17,5.7419731133930778,47.786701786561039,7.9393098189597402E-16,7.9393098189597402E-16,92.766706527239052,8.1676563660574694E-16,-6.6666666666666687,2.4000000000000008,0.1,0,0,0,1.700075048223318E-3,0,0,0,3000,3.9172759722222217E-4]
[2.4000000000000008,2.0769236660945074,4.2850674818959083E-16,-12.348024134107323,3.7320219462780577,-3.7320219462780577,4.5722809211676229E-16,1.1700204233359599,13.646155104790484,-7.6673846967822481,3.7910080003016259E-17,6.4934916022794589,47.917720306202668,8.3716075751496325E-16,8.3716075751496325E-16,91.596839029851111,8.5079753813098636E-16,-6.9444444444444464,2.5000000000000009,0.1,0,0,0,1.4140229789338166E-3,0,0,0,3000,3.8012149999999987E-4]
[2.5000000000000009,1.3101851964162825,4.3229775618989245E-16,-11.698674973879378,3.7284089404206568,-3.7284089404206568,4.567854452623853E-16,1.1701662063014597,12.737598950361063,-7.4503433252831401,3.6208848317238499E-17,7.4933063607132908,47.974235392591467,8.8075262161712491E-16,8.8075262161712491E-16,90.501904596070304,8.8482943965622588E-16,-7.222222222222225,2.600000000000001,0.1,0,0,0,1.1429039142441921E-3,0,0,0,3000,3.6868993055555536E-4]
[2.600000000000001,0.56515086388796842,4.3591864102161628E-16,-10.949344337808048,3.7249857610183463,-3.7249857610183463,4.5636605496682374E-16,1.1703026679442605,11.75982200920795,-7.3218087606835836,3.4896803446350157E-17,8.8818186973077751,47.957532391373427,9.2469345375375006E-16,9.2469345375375006E-16,89.495788349262583,9.188613411814654E-16,-7.5000000000000027,2.7000000000000011,0.1,0,0,0,8.8639322291394378E-4,0,0,0,3000,3.5743288888888879E-4]
[2.7000000000000011,-0.16703001218038993,4.3940832136625131E-16,-10.061162468077271,3.7218039531331697,-3.7218039531331697,4.5597623626538964E-16,1.1704280742090891,10.670679827467586,-7.3408562012665968,3.4213900194395646E-17,10.972002454321991,47.86742082814272,9.6897642489231918E-16,9.6897642489231918E-16,88.599392126998069,9.5289324270670483E-16,-7.7777777777777803,2.8000000000000012,0.1,0,0,0,6.441662737025701E-4,0,0,0,3000,3.4635037499999985E-4]
[2.8000000000000012,-0.90111563230704961,4.4282971138569087E-16,-8.9639622226450708,3.7189391897068806,-3.7189391897068806,4.5562526021685001E-16,1.1705398158606719,9.3964221025689021,-7.6872922156578456,3.4907481224837525E-17,14.649546429861068,47.700436342755438,1.0136084708431367E-15,1.0136084708431367E-15,87.849491369032165,9.8692514423194425E-16,-8.0555555555555589,2.9000000000000012,0.1,0,0,0,4.158984353695735E-4,0,0,0,3000,3.3544238888888868E-4]
[2.9000000000000012,-1.6698448538728341,4.4632045950817465E-16,-7.4990075796589641,3.7165205021835281,-3.7165205021835281,4.5532893508863576E-16,1.1706333040898469,7.7732873283553978,-9.2401848494881946,4.0670821311753329E-17,24.050983130964113,47.441050008873276,1.0586472250070716E-15,1.0586472250070716E-15,87.340100442375913,1.0209570457571839E-15,-8.3333333333333375,3.0000000000000013,0.1,0,0,0,2.0126507667445301E-4,0,0,0,3000,3.247089305555554E-4]
[3.0000000000000013,-2.5938633388216537,4.5038754163934995E-16,-5.0939092665625525,3.7148658700887163,-3.7148658700887163,4.5512621809319574E-16,1.1706968128257578,5.2157989120631374,11316.870508362879,-4.7838418124343382E-14,-51434.409265505034,47.441050008873276,1.0586472250070716E-15,1.0586472250070716E-15,87.340100442375913,1.0549889472824231E-15,-8.6111111111111143,3.1000000000000014,0.1,47.441050008873276,1.0586472250070716E-15,87.340100442375913,{"$f":"IF($B$24=\"C\",IF((3.14159265*1860/4)*((0.001*$B$18)-(2*$B$26*A61))^2*((0.33333*0.001*$B$18)-(2*$B$26*A61))<0,(3.14159265*1860/4)*((0.001*$B$18)-(2*$B$26*A61))^2*((0.33333*0.001*$B$18)-(2*$B$26*A61)),(3.14159265*1860/4)*((0.001*$B$18)-(2*$B$26*A61))^2*((0.33333*0.001*$B$18)-(2*$B$26*A61))),$B$19)","v":-5.843362329269393E-8},47.441050008873276,1.0586472250070716E-15,87.340100442375913,3.1000000000000014,3.141499999999998E-4]
[3.1000000000000014,1129.0931874974663,-4.3334542707949882E-15,-5148.5348358170659,3.7148658700887163,-3.7148658700887163,4.5512621809319574E-16,1.1706968128257578,5271.6852183525007,3466535.8629767704,-1.465366171094451E-11,-15755177.326177737,47.441050008873276,1.0586472250070716E-15,1.0586472250070716E-15,87.340100442375913,1.0890208488076627E-15,-8.8888888888888928,3.2000000000000015,0.1,0,0,0,{"$f":"IF($B$24=\"C\",IF((3.14159265*1860/4)*((0.001*$B$18)-(2*$B$26*A62))^2*((0.33333*0.001*$B$18)-(2*$B$26*A62))<0,(3.14159265*1860/4)*((0.001*$B$18)-(2*$B$26*A62))^2*((0.33333*0.001*$B$18)-(2*$B$26*A62)),(3.14159265*1860/4)*((0.001*$B$18)-(2*$B$26*A62))^2*((0.33333*0.001*$B$18)-(2*$B$26*A62))),$B$19)","v":-1.8839672676416132E-4},47.441050008873276,1.0586472250070716E-15,87.340100442375913,3.2000000000000015,3.0376559722222198E-4]
[3.2000000000000015,347782.67948517454,-1.469699625365246E-12,-1580666.2674535909,3.7148658700887163,-3.7148658700887163,4.5512621809319574E-16,1.1706968128257578,1618474.9689634892,163396823284.72794,-6.9070734234415411E-7,-742627805382.05725,47.441050008873276,1.0586472250070716E-15,1.0586472250070716E-15,87.340100442375913,1.1230527503329023E-15,-9.1666666666666714,3.3000000000000016,0.1,0,0,0,-3.6407443398865511E-4,47.441050008873276,1.0586472250070716E-15,87.340100442375913,3.3000000000000016,2.9355572222222205E-4]
[3.3000000000000016,16340030111.152279,-6.9072203934040774E-8,-74264361204.47319,3.7148658700887163,-3.7148658700887163,4.5512621809319574E-16,1.1706968128257578,76040725465.12973,2.4046650475112104E+20,-1016.4945503867619,-1.0929044341335732E+21,47.441050008873276,1.0586472250070716E-15,1.0586472250070716E-15,87.340100442375913,1.1570846518581416E-15,-9.4444444444444482,3.4000000000000017,0.1,0,0,0,-5.2741618653727169E-4,47.441050008873276,1.0586472250070716E-15,87.340100442375913,3.4000000000000017,2.835203749999998E-4]
[3.4000000000000017,2.4046650491452133E+19,-101.64945510774839,-1.0929044348762169E+20,3.7148658700887163,-3.7148658700887163,4.5512621809319574E-16,1.1706968128257578,1.119046131201886E+20,3.9059815511677308E+38,-1.6511276548817221E+21,-1.775242901847537E+39,47.441050008873276,1.0586472250070716E-15,1.0586472250070716E-15,87.340100442375913,1.1911165533833812E-15,-9.7222222222222268,3.5000000000000018,0.1,0,0,0,-6.7874661565051259E-4,47.441050008873276,1.0586472250070716E-15,87.340100442375913,3.5000000000000018,2.7365955555555533E-4]
[3.5000000000000018,3.9059815511677309E+37,-1.651127654881722E+20,-1.775242901847537E+38,3.7148658700887163,-3.7148658700887163,4.5512621809319574E-16,1.1706968128257578,1.817705773589524E+38,8.2447574115471267E+74,-3.4852051377269616E+57,-3.7471879681377914E+75,47.441050008873276,1.0586472250070716E-15,1.0586472250070716E-15,87.340100442375913,1.2251484549086206E-15,-10.000000000000005,3.6000000000000019,0.1,0,0,0,-8.1839035256887839E-4,47.441050008873276,1.0586472250070716E-15,87.340100442375913,3.6000000000000019,2.6397326388888869E-4]
[3.6000000000000019,8.2447574115471277E+73,-3.4852051377269619E+56,-3.7471879681377914E+74,3.7148658700887163,-3.7148658700887163,4.5512621809319574E-16,1.1706968128257578,3.8368187234099609E+74,3.0612328605857114E+147,-1.2940374059459299E+130,-1.391310182976296E+148,47.441050008873276,1.0586472250070716E-15,1.0586472250070716E-15,87.340100442375913,1.25918035643386E-15,-10.277777777777782,3.700000000000002,0.1,0,0,0,-9.4667202853286711E-4,47.441050008873276,1.0586472250070716E-15,87.340100442375913,3.700000000000002,2.5446149999999978E-4]
[3.700000000000002,3.0612328605857116E+146,-1.29403740594593E+129,-1.3913101829762961E+147,3.7148658700887163,-3.7148658700887163,4.5512621809319574E-16,1.1706968128257578,1.4245895870463298E+147,3.6173426469351217E+292,-1.5291148724837249E+275,-1.6440584199897551E+293,47.441050008873276,1.0586472250070716E-15,1.0586472250070716E-15,87.340100442375913,1.2932122579590994E-15,-10.555555555555561,3.800000000000002,0.1,0,0,0,-1.0639162747829798E-3,47.441050008873276,1.0586472250070716E-15,87.340100442375913,3.800000000000002,2.4512426388888865E-4]
[3.800000000000002,3.6173426469351219E+291,-1.529114872483725E+274,-1.6440584199897552E+292,3.7148658700887163,-3.7148658700887163,4.5512621809319574E-16,1.1706968128257578,{"$error":"#NUM!"},{"$error":"#NUM!"},{"$error":"#NUM!"},{"$error":"#NUM!"},47.441050008873276,1.0586472250070716E-15,1.0586472250070716E-15,87.340100442375913,1.3272441594843391E-15,-10.833333333333339,3.9000000000000021,0.1,0,0,0,-1.1704477225597178E-3,47.441050008873276,1.0586472250070716E-15,87.340100442375913,3.9000000000000021,2.3596155555555536E-4]
[3.9000000000000021,{"$error":"#NUM!"},{"$error":"#NUM!"},{"$error":"#NUM!"},3.7148658700887163,-3.7148658700887163,4.5512621809319574E-16,1.1706968128257578,{"$error":"#NUM!"},{"$error":"#NUM!"},{"$error":"#NUM!"},{"$error":"#NUM!"},47.441050008873276,1.0586472250070716E-15,1.0586472250070716E-15,87.340100442375913,1.3612760610095785E-15,-11.111111111111116,4.0000000000000018,{"$error":"#NUM!"},0,0,0,-1.2665910031035789E-3,47.441050008873276,1.0586472250070716E-15,87.340100442375913,4.0000000000000018,2.2697337499999977E-4]
[4.0000000000000018,{"$error":"#NUM!"},{"$error":"#NUM!"},{"$error":"#NUM!"},3.7148658700887163,-3.7148658700887163,4.5512621809319574E-16,1.1706968128257578,{"$error":"#NUM!"},{"$error":"#NUM!"},{"$error":"#NUM!"},{"$error":"#NUM!"},47.441050008873276,1.0586472250070716E-15,1.0586472250070716E-15,87.340100442375913,1.3953079625348177E-15,-11.388888888888893,4.1000000000000014,{"$error":"#NUM!"},0,0,0,-1.3526707476550636E-3,47.441050008873276,1.0586472250070716E-15,87.340100442375913,4.1000000000000014,2.1815972222222207E-4]
[4.1000000000000014,{"$error":"#NUM!"},{"$error":"#NUM!"},{"$error":"#NUM!"},3.7148658700887163,-3.7148658700887163,4.5512621809319574E-16,1.1706968128257578,{"$error":"#NUM!"},{"$error":"#NUM!"},{"$error":"#NUM!"},{"$error":"#NUM!"},47.441050008873276,1.0586472250070716E-15,1.0586472250070716E-15,87.340100442375913,1.4293398640600571E-15,-11.66666666666667,4.2000000000000011,{"$error":"#NUM!"},0,0,0,-1.4290115874546728E-3,47.441050008873276,1.0586472250070716E-15,87.340100442375913,4.2000000000000011,2.0952059722222202E-4]
[4.2000000000000011,{"$error":"#NUM!"},{"$error":"#NUM!"},{"$error":"#NUM!"},3.7148658700887163,-3.7148658700887163,4.5512621809319574E-16,1.1706968128257578,{"$error":"#NUM!"},{"$error":"#NUM!"},{"$error":"#NUM!"},{"$error":"#NUM!"},47.441050008873276,1.0586472250070716E-15,1.0586472250070716E-15,87.340100442375913,1.4633717655852964E-15,-11.944444444444446,4.3000000000000007,{"$error":"#NUM!"},0,0,0,-1.4959381537429054E-3,47.441050008873276,1.0586472250070716E-15,87.340100442375913,4.3000000000000007,2.0105599999999983E-4]
[4.3000000000000007,{"$error":"#NUM!"},{"$error":"#NUM!"},{"$error":"#NUM!"},3.7148658700887163,-3.7148658700887163,4.5512621809319574E-16,1.1706968128257578,{"$error":"#NUM!"},{"$error":"#NUM!"},{"$error":"#NUM!"},{"$error":"#NUM!"},47.441050008873276,1.0586472250070716E-15,1.0586472250070716E-15,87.340100442375913,1.4974036671105358E-15,-12.222222222222223,4.4000000000000004,{"$error":"#NUM!"},0,0,0,-1.5537750777602634E-3,47.441050008873276,1.0586472250070716E-15,87.340100442375913,4.4000000000000004,1.9276593055555545E-4]
[4.4000000000000004,{"$error":"#NUM!"},{"$error":"#NUM!"},{"$error":"#NUM!"},3.7148658700887163,-3.7148658700887163,4.5512621809319574E-16,1.1706968128257578,{"$error":"#NUM!"},{"$error":"#NUM!"},{"$error":"#NUM!"},{"$error":"#NUM!"},47.441050008873276,1.0586472250070716E-15,1.0586472250070716E-15,87.340100442375913,1.531435568635775E-15,-12.5,4.5,{"$error":"#NUM!"},0,0,0,-1.6028469907472447E-3,47.441050008873276,1.0586472250070716E-15,87.340100442375913,4.5,1.8465038888888885E-4]
[4.5,{"$error":"#NUM!"},{"$error":"#NUM!"},{"$error":"#NUM!"},3.7148658700887163,-3.7148658700887163,4.5512621809319574E-16,1.1706968128257578,{"$error":"#NUM!"},{"$error":"#NUM!"},{"$error":"#NUM!"},{"$error":"#NUM!"},47.441050008873276,1.0586472250070716E-15,1.0586472250070716E-15,87.340100442375913,1.5654674701610142E-15,-12.777777777777777,4.5999999999999996,{"$error":"#NUM!"},0,0,0,-1.6434785239443502E-3,47.441050008873276,1.0586472250070716E-15,87.340100442375913,4.5999999999999996,1.7670937499999996E-4]
[4.5999999999999996,{"$error":"#NUM!"},{"$error":"#NUM!"},{"$error":"#NUM!"},3.7148658700887163,-3.7148658700887163,4.5512621809319574E-16,1.1706968128257578,{"$error":"#NUM!"},{"$error":"#NUM!"},{"$error":"#NUM!"},{"$error":"#NUM!"},47.441050008873276,1.0586472250070716E-15,1.0586472250070716E-15,87.340100442375913,1.5994993716862537E-15,-13.055555555555554,4.6999999999999993,{"$error":"#NUM!"},0,0,0,-1.6759943085920799E-3,47.441050008873276,1.0586472250070716E-15,87.340100442375913,4.6999999999999993,1.689428888888889E-4]
[4.6999999999999993,{"$error":"#NUM!"},{"$error":"#NUM!"},{"$error":"#NUM!"},3.7148658700887163,-3.7148658700887163,4.5512621809319574E-16,1.1706968128257578,{"$error":"#NUM!"},{"$error":"#NUM!"},{"$error":"#NUM!"},{"$error":"#NUM!"},47.441050008873276,1.0586472250070716E-15,1.0586472250070716E-15,87.340100442375913,1.6335312732114929E-15,-13.33333333333333,4.7999999999999989,{"$error":"#NUM!"},0,0,0,-1.7007189759309337E-3,47.441050008873276,1.0586472250070716E-15,87.340100442375913,4.7999999999999989,1.6135093055555556E-4]
[4.7999999999999989,{"$error":"#NUM!"},{"$error":"#NUM!"},{"$error":"#NUM!"},3.7148658700887163,-3.7148658700887163,4.5512621809319574E-16,1.1706968128257578,{"$error":"#NUM!"},{"$error":"#NUM!"},{"$error":"#NUM!"},{"$error":"#NUM!"},47.441050008873276,1.0586472250070716E-15,1.0586472250070716E-15,87.340100442375913,1.6675631747367323E-15,-13.611111111111107,4.8999999999999986,{"$error":"#NUM!"},0,0,0,-1.7179771572014117E-3,47.441050008873276,1.0586472250070716E-15,87.340100442375913,4.8999999999999986,1.5393350000000004E-4]
[4.8999999999999986,{"$error":"#NUM!"},{"$error":"#NUM!"},{"$error":"#NUM!"},3.7148658700887163,-3.7148658700887163,4.5512621809319574E-16,1.1706968128257578,{"$error":"#NUM!"},{"$error":"#NUM!"},{"$error":"#NUM!"},{"$error":"#NUM!"},47.441050008873276,1.0586472250070716E-15,1.0586472250070716E-15,87.340100442375913,1.7015950762619715E-15,-13.888888888888884,4.9999999999999982,{"$error":"#NUM!"},0,0,0,-1.7280934836440135E-3,47.441050008873276,1.0586472250070716E-15,87.340100442375913,4.9999999999999982,1.4669059722222233E-4]
[4.9999999999999982,{"$error":"#NUM!"},{"$error":"#NUM!"},{"$error":"#NUM!"},3.7148658700887163,-3.7148658700887163,4.5512621809319574E-16,1.1706968128257578,{"$error":"#NUM!"},{"$error":"#NUM!"},{"$error":"#NUM!"},{"$error":"#NUM!"},47.441050008873276,1.0586472250070716E-15,1.0586472250070716E-15,87.340100442375913,1.735626977787211E-15,-14.166666666666661,5.0999999999999979,{"$error":"#NUM!"},0,0,0,-1.7313925864992396E-3,47.441050008873276,1.0586472250070716E-15,87.340100442375913,5.0999999999999979,1.3962222222222229E-4]
[5.0999999999999979,{"$error":"#NUM!"},{"$error":"#NUM!"},{"$error":"#NUM!"},3.7148658700887163,-3.7148658700887163,4.5512621809319574E-16,1.1706968128257578,{"$error":"#NUM!"},{"$error":"#NUM!"},{"$error":"#NUM!"},{"$error":"#NUM!"},47.441050008873276,1.0586472250070716E-15,1.0586472250070716E-15,87.340100442375913,1.7696588793124502E-15,-14.444444444444438,5.1999999999999975,{"$error":"#NUM!"},0,0,0,-1.7281990970075898E-3,47.441050008873276,1.0586472250070716E-15,{"$f":"IF(X82<=0,P82,0)","v":87.340100442375913},5.1999999999999975,1.3272837500000011E-4]
[5.1999999999999975,{"$error":"#NUM!"},{"$error":"#NUM!"},{"$error":"#NUM!"},3.7148658700887163,-3.7148658700887163,4.5512621809319574E-16,1.1706968128257578,{"$error":"#NUM!"},{"$error":"#NUM!"},{"$error":"#NUM!"},{"$error":"#NUM!"},47.441050008873276,1.0586472250070716E-15,1.0586472250070716E-15,87.340100442375913,1.8036907808376896E-15,-14.722222222222214,5.2999999999999972,{"$error":"#NUM!"},0,0,0,-1.7188376464095639E-3,47.441050008873276,1.0586472250070716E-15,87.340100442375913,5.2999999999999972,1.2600905555555569E-4]
[5.2999999999999972,{"$error":"#NUM!"},{"$error":"#NUM!"},{"$error":"#NUM!"},3.7148658700887163,-3.7148658700887163,4.5512621809319574E-16,1.1706968128257578,{"$error":"#NUM!"},{"$error":"#NUM!"},{"$error":"#NUM!"},{"$error":"#NUM!"},47.441050008873276,1.0586472250070716E-15,1.0586472250070716E-15,87.340100442375913,1.8377226823629288E-15,-14.999999999999991,5.3999999999999968,{"$error":"#NUM!"},0,0,0,-1.7036328659456625E-3,47.441050008873276,1.0586472250070716E-15,87.340100442375913,5.3999999999999968,1.1946426388888906E-4]
[5.3999999999999968,{"$error":"#NUM!"},{"$error":"#NUM!"},{"$error":"#NUM!"},3.7148658700887163,-3.7148658700887163,4.5512621809319574E-16,1.1706968128257578,{"$error":"#NUM!"},{"$error":"#NUM!"},{"$error":"#NUM!"},{"$error":"#NUM!"},47.441050008873276,1.0586472250070716E-15,1.0586472250070716E-15,87.340100442375913,1.8717545838881681E-15,-15.277777777777768,5.4999999999999964,{"$error":"#NUM!"},0,0,0,-1.6829093868563846E-3,47.441050008873276,1.0586472250070716E-15,87.340100442375913,5.4999999999999964,1.1309400000000013E-4]
[5.4999999999999964,{"$error":"#NUM!"},{"$error":"#NUM!"},{"$error":"#NUM!"},3.7148658700887163,-3.7148658700887163,4.5512621809319574E-16,1.1706968128257578,{"$error":"#NUM!"},{"$error":"#NUM!"},{"$error":"#NUM!"},{"$error":"#NUM!"},47.441050008873276,1.0586472250070716E-15,1.0586472250070716E-15,87.340100442375913,1.9057864854134077E-15,-15.555555555555545,5.5999999999999961,{"$error":"#NUM!"},0,0,0,-1.6569918403822311E-3,47.441050008873276,1.0586472250070716E-15,87.340100442375913,5.5999999999999961,1.0689826388888906E-4]
[5.5999999999999961,{"$error":"#NUM!"},{"$error":"#NUM!"},{"$error":"#NUM!"},3.7148658700887163,-3.7148658700887163,4.5512621809319574E-16,1.1706968128257578,{"$error":"#NUM!"},{"$error":"#NUM!"},{"$error":"#NUM!"},{"$error":"#NUM!"},47.441050008873276,1.0586472250070716E-15,1.0586472250070716E-15,87.340100442375913,1.9398183869386469E-15,-15.833333333333321,5.6999999999999957,{"$error":"#NUM!"},0,0,0,-1.6262048577637019E-3,47.441050008873276,1.0586472250070716E-15,87.340100442375913,5.6999999999999957,1.0087705555555576E-4]
[5.6999999999999957,{"$error":"#NUM!"},{"$error":"#NUM!"},{"$error":"#NUM!"},3.7148658700887163,-3.7148658700887163,4.5512621809319574E-16,1.1706968128257578,{"$error":"#NUM!"},{"$error":"#NUM!"},{"$error":"#NUM!"},{"$error":"#NUM!"},47.441050008873276,1.0586472250070716E-15,1.0586472250070716E-15,87.340100442375913,1.9738502884638861E-15,-16.111111111111097,5.7999999999999954,{"$error":"#NUM!"},0,0,0,-1.5908730702412963E-3,47.441050008873276,1.0586472250070716E-15,87.340100442375913,5.7999999999999954,9.5030375000000226E-5]
[5.7999999999999954,{"$error":"#NUM!"},{"$error":"#NUM!"},{"$error":"#NUM!"},3.7148658700887163,-3.7148658700887163,4.5512621809319574E-16,1.1706968128257578,{"$error":"#NUM!"},{"$error":"#NUM!"},{"$error":"#NUM!"},{"$error":"#NUM!"},47.441050008873276,1.0586472250070716E-15,1.0586472250070716E-15,87.340100442375913,2.0078821899891254E-15,-16.388888888888875,5.899999999999995,{"$error":"#NUM!"},0,0,0,-1.5513211090555149E-3,47.441050008873276,1.0586472250070716E-15,87.340100442375913,5.899999999999995,8.9358222222222429E-5]
[5.899999999999995,{"$error":"#NUM!"},{"$error":"#NUM!"},{"$error":"#NUM!"},3.7148658700887163,-3.7148658700887163,4.5512621809319574E-16,1.1706968128257578,{"$error":"#NUM!"},{"$error":"#NUM!"},{"$error":"#NUM!"},{"$error":"#NUM!"},47.441050008873276,1.0586472250070716E-15,1.0586472250070716E-15,87.340100442375913,2.0419140915143646E-15,-16.66666666666665,5.9999999999999947,{"$error":"#NUM!"},0,0,0,-1.5078736054468576E-3,47.441050008873276,1.0586472250070716E-15,{"$f":"IF(X90=0,P90,0)","v":0},5.9999999999999947,8.3860597222222455E-5]
[5.9999999999999947,{"$error":"#NUM!"},{"$error":"#NUM!"},{"$error":"#NUM!"},3.7148658700887163,-3.7148658700887163,4.5512621809319574E-16,1.1706968128257578,{"$error":"#NUM!"},{"$error":"#NUM!"},{"$error":"#NUM!"},{"$error":"#NUM!"},47.441050008873276,1.0586472250070716E-15,1.0586472250070716E-15,87.340100442375913,2.0759459930396042E-15,-16.944444444444429,6.0999999999999943,{"$error":"#NUM!"},0,0,0,-1.4608551906558247E-3,47.441050008873276,1.0586472250070716E-15,{"$f":"IF(X91<=0,P91,0)","v":87.340100442375913},6.0999999999999943,7.8537500000000249E-5]
[6.0999999999999943,{"$error":"#NUM!"},{"$error":"#NUM!"},{"$error":"#NUM!"},3.7148658700887163,-3.7148658700887163,4.5512621809319574E-16,1.1706968128257578,{"$error":"#NUM!"},{"$error":"#NUM!"},{"$error":"#NUM!"},{"$error":"#NUM!"},47.441050008873276,1.0586472250070716E-15,1.0586472250070716E-15,87.340100442375913,2.1099778945648434E-15,-17.222222222222204,6.199999999999994,{"$error":"#NUM!"},0,0,0,-1.4105904959229156E-3,47.441050008873276,1.0586472250070716E-15,87.340100442375913,6.199999999999994,7.3388930555555825E-5]
[6.199999999999994,{"$error":"#NUM!"},{"$error":"#NUM!"},{"$error":"#NUM!"},3.7148658700887163,-3.7148658700887163,4.5512621809319574E-16,1.1706968128257578,{"$error":"#NUM!"},{"$error":"#NUM!"},{"$error":"#NUM!"},{"$error":"#NUM!"},47.441050008873276,1.0586472250070716E-15,1.0586472250070716E-15,87.340100442375913,2.1440097960900827E-15,-17.499999999999982,6.2999999999999936,{"$error":"#NUM!"},0,0,0,-1.3574041524886302E-3,47.441050008873276,1.0586472250070716E-15,87.340100442375913,6.2999999999999936,6.8414888888889129E-5]
[6.2999999999999936,{"$error":"#NUM!"},{"$error":"#NUM!"},{"$error":"#NUM!"},3.7148658700887163,-3.7148658700887163,4.5512621809319574E-16,1.1706968128257578,{"$error":"#NUM!"},{"$error":"#NUM!"},{"$error":"#NUM!"},{"$error":"#NUM!"},47.441050008873276,1.0586472250070716E-15,1.0586472250070716E-15,87.340100442375913,2.1780416976153219E-15,-17.777777777777757,6.3999999999999932,{"$error":"#NUM!"},0,0,0,-1.3016207915934692E-3,47.441050008873276,1.0586472250070716E-15,87.340100442375913,6.3999999999999932,6.3615375000000257E-5]
[6.3999999999999932,{"$error":"#NUM!"},{"$error":"#NUM!"},{"$error":"#NUM!"},3.7148658700887163,-3.7148658700887163,4.5512621809319574E-16,1.1706968128257578,{"$f":"SQRT(((B95-F95)^2)+((C95-G95)^2)+(D95^2))","v":{"$error":"#NUM!"}},{"$error":"#NUM!"},{"$error":"#NUM!"},{"$error":"#NUM!"},47.441050008873276,1.0586472250070716E-15,{"$f":"ABS(N95)","v":1.0586472250070716E-15},87.340100442375913,2.2120735991405615E-15,-18.055555555555536,6.4999999999999929,{"$error":"#NUM!"},0,0,0,-1.2435650444779325E-3,47.441050008873276,1.0586472250070716E-15,87.340100442375913,6.4999999999999929,5.8990388888889166E-5]
[{"$f":"A95+$B$22","v":6.4999999999999929},{"$f":"B95+(J95*$B$22)","v":{"$error":"#NUM!"}},{"$f":"C95+(K95*$B$22)","v":{"$error":"#NUM!"}},{"$f":"D95+(L95*$B$22)","v":{"$error":"#NUM!"}},{"$f":"IF($B$13=2,$B$23*((0.1036*LN(ABS(P95+1)))+0.8731),IF($B$13=3,$B$23*((0.139*LN(ABS(P95+1)))+0.7503),$B$23))","v":3.7148658700887163},{"$f":"E96*COS(RADIANS($B$10))","v":-3.7148658700887163},{"$f":"E96*SIN(RADIANS($B$10))","v":4.5512621809319574E-16},{"$f":"1.22*EXP(-0.0001065*(P95+$B$12))","v":1.1706968128257578},{"$error":"#NUM!"},{"$error":"#NUM!"},{"$error":"#NUM!"},{"$error":"#NUM!"},{"$f":"IF(X96>0,IF(P95<=Param_1,M95,M95+(B97*$B$22)),M95)","v":47.441050008873276},{"$f":"IF(X96>0,IF(P95<=Param_1,N95,N95+(C97*$B$22)),N95)","v":1.0586472250070716E-15},1.0586472250070716E-15,{"$f":"IF(X96>0,IF(P95<Param_1,P95,P95+(D97*$B$22)),P95)","v":87.340100442375913},{"$f":"IF(P95<Param_1,Q95,A97*$B$23*SIN(RADIANS($B$10)))","v":2.2461055006658007E-15},{"$f":"IF(P95<Param_1,R95,A97*$B$23*COS(RADIANS($B$10)))","v":-18.333333333333311},{"$f":"IF(P95<Param_1,S95,A97)","v":6.5999999999999925},{"$error":"#NUM!"},0,0,0,-1.1835615423825198E-3,{"$f":"IF(X96<=0,M96,0)","v":47.441050008873276},{"$f":"IF(X96<=0,N96,0)","v":1.0586472250070716E-15},87.340100442375913,{"$f":"IF(X96<=0,S96,3000)","v":6.5999999999999925},{"$f":"IF($B$24=\"S\",$B$20,3.1415*(($B$18*0.0005)-($B$26*A96))^2)","v":5.4539930555555857E-5}]
[6.5999999999999925,{"$error":"#NUM!"},{"$error":"#NUM!"},{"$error":"#NUM!"},3.7148658700887163,-3.7148658700887163,4.5512621809319574E-16,1.1706968128257578,{"$error":"#NUM!"},{"$f":"-0.5*H97*I97*AC97*$B$17*(B97-F97)/X97","v":{"$error":"#NUM!"}},{"$f":"-0.5*H97*I97*AC97*$B$17*(C97-G97)/X97","v":{"$error":"#NUM!"}},{"$f":"(-0.5*H97*AC97*I97*$B$17*D97/X97)-$B$21","v":{"$error":"#NUM!"}},47.441050008873276,1.0586472250070716E-15,1.0586472250070716E-15,87.340100442375913,2.2801374021910399E-15,-18.611111111111089,6.6999999999999922,{"$f":"IF(D97<0,T96,A98)","v":{"$error":"#NUM!"}},{"$f":"IF(ROUND(A97*10,3)=$B$14*10,M97,0)","v":0},{"$f":"IF(ROUND(A97*10,3)=$B$14*10,N97,0)","v":0},{"$f":"IF(ROUND(A97*10,3)=$B$14*10,P97,0)","v":0},-1.1219349165477303E-3,47.441050008873276,1.0586472250070716E-15,87.340100442375913,6.6999999999999922,5.026400000000027E-5]
[6.6999999999999922,{"$error":"#NUM!"},{"$error":"#NUM!"},{"$error":"#NUM!"},3.7148658700887163,-3.7148658700887163,4.5512621809319574E-16,1.1706968128257578,{"$error":"#NUM!"},{"$error":"#NUM!"},{"$error":"#NUM!"},{"$error":"#NUM!"},47.441050008873276,1.0586472250070716E-15,1.0586472250070716E-15,87.340100442375913,2.3141693037162792E-15,-18.888888888888864,6.7999999999999918,{"$error":"#NUM!"},0,0,0,-1.0590097982140657E-3,47.441050008873276,1.0586472250070716E-15,87.340100442375913,6.7999999999999918,4.6162597222222505E-5]
[6.7999999999999918,{"$error":"#NUM!"},{"$error":"#NUM!"},{"$error":"#NUM!"},3.7148658700887163,-3.7148658700887163,4.5512621809319574E-16,1.1706968128257578,{"$error":"#NUM!"},{"$error":"#NUM!"},{"$error":"#NUM!"},{"$error":"#NUM!"},47.441050008873276,1.0586472250070716E-15,1.0586472250070716E-15,87.340100442375913,2.3482012052415188E-15,-19.166666666666643,6.8999999999999915,{"$error":"#NUM!"},0,0,0,-9.9511081862202477E-4,47.441050008873276,1.0586472250070716E-15,87.340100442375913,6.8999999999999915,4.2235722222222515E-5]
[6.8999999999999915,{"$error":"#NUM!"},{"$error":"#NUM!"},{"$error":"#NUM!"},3.7148658700887163,-3.7148658700887163,4.5512621809319574E-16,1.1706968128257578,{"$error":"#NUM!"},{"$error":"#NUM!"},{"$error":"#NUM!"},{"$error":"#NUM!"},47.441050008873276,1.0586472250070716E-15,1.0586472250070716E-15,87.340100442375913,2.382233106766758E-15,-19.444444444444418,6.9999999999999911,{"$error":"#NUM!"},0,0,0,-9.3056260901210823E-4,47.441050008873276,1.0586472250070716E-15,87.340100442375913,6.9999999999999911,3.8483375000000301E-5]
[6.9999999999999911,{"$error":"#NUM!"},{"$error":"#NUM!"},{"$error":"#NUM!"},3.7148658700887163,-3.7148658700887163,4.5512621809319574E-16,1.1706968128257578,{"$error":"#NUM!"},{"$error":"#NUM!"},{"$error":"#NUM!"},{"$error":"#NUM!"},47.441050008873276,1.0586472250070716E-15,1.0586472250070716E-15,87.340100442375913,2.4162650082919972E-15,-19.722222222222197,7.0999999999999908,{"$error":"#NUM!"},0,0,0,-8.6568980062481492E-4,47.441050008873276,1.0586472250070716E-15,87.340100442375913,7.0999999999999908,3.4905555555555822E-5]
[7.0999999999999908,{"$error":"#NUM!"},{"$error":"#NUM!"},{"$error":"#NUM!"},3.7148658700887163,-3.7148658700887163,4.5512621809319574E-16,1.1706968128257578,{"$error":"#NUM!"},{"$error":"#NUM!"},{"$error":"#NUM!"},{"$error":"#NUM!"},47.441050008873276,1.0586472250070716E-15,1.0586472250070716E-15,87.340100442375913,2.4502969098172365E-15,-19.999999999999972,7.1999999999999904,{"$error":"#NUM!"},0,0,0,-8.0081702470064637E-4,47.441050008873276,1.0586472250070716E-15,87.340100442375913,7.1999999999999904,3.1502263888889165E-5]
[7.1999999999999904,{"$error":"#NUM!"},{"$error":"#NUM!"},{"$error":"#NUM!"},3.7148658700887163,-3.7148658700887163,4.5512621809319574E-16,1.1706968128257578,{"$error":"#NUM!"},{"$error":"#NUM!"},{"$error":"#NUM!"},{"$error":"#NUM!"},47.441050008873276,1.0586472250070716E-15,1.0586472250070716E-15,87.340100442375913,2.4843288113424761E-15,-20.27777777777775,7.2999999999999901,{"$error":"#NUM!"},0,0,0,-7.3626891248010178E-4,47.441050008873276,1.0586472250070716E-15,87.340100442375913,7.2999999999999901,2.8273500000000277E-5]
[7.2999999999999901,{"$error":"#NUM!"},{"$error":"#NUM!"},{"$error":"#NUM!"},3.7148658700887163,-3.7148658700887163,4.5512621809319574E-16,1.1706968128257578,{"$error":"#NUM!"},{"$error":"#NUM!"},{"$error":"#NUM!"},{"$error":"#NUM!"},47.441050008873276,1.0586472250070716E-15,1.0586472250070716E-15,87.340100442375913,2.5183607128677153E-15,-20.555555555555525,7.3999999999999897,{"$error":"#NUM!"},0,0,0,-6.7237009520368114E-4,47.441050008873276,1.0586472250070716E-15,87.340100442375913,7.3999999999999897,2.5219263888889168E-5]
[7.3999999999999897,{"$error":"#NUM!"},{"$error":"#NUM!"},{"$error":"#NUM!"},3.7148658700887163,-3.7148658700887163,4.5512621809319574E-16,1.1706968128257578,{"$error":"#NUM!"},{"$error":"#NUM!"},{"$error":"#NUM!"},{"$error":"#NUM!"},47.441050008873276,1.0586472250070716E-15,1.0586472250070716E-15,87.340100442375913,2.5523926143929545E-15,-20.833333333333304,7.4999999999999893,{"$error":"#NUM!"},0,0,0,-6.0944520411188399E-4,47.441050008873276,1.0586472250070716E-15,87.340100442375913,7.4999999999999893,2.2339555555555811E-5]
[7.4999999999999893,{"$error":"#NUM!"},{"$error":"#NUM!"},{"$error":"#NUM!"},3.7148658700887163,-3.7148658700887163,4.5512621809319574E-16,1.1706968128257578,{"$error":"#NUM!"},{"$error":"#NUM!"},{"$error":"#NUM!"},{"$error":"#NUM!"},47.441050008873276,1.0586472250070716E-15,1.0586472250070716E-15,87.340100442375913,2.5864245159181938E-15,-21.111111111111079,7.599999999999989,{"$error":"#NUM!"},0,0,0,-5.4781887044521151E-4,47.441050008873276,1.0586472250070716E-15,87.340100442375913,7.599999999999989,1.9634375000000255E-5]
[7.599999999999989,{"$error":"#NUM!"},{"$error":"#NUM!"},{"$error":"#NUM!"},3.7148658700887163,-3.7148658700887163,4.5512621809319574E-16,1.1706968128257578,{"$error":"#NUM!"},{"$error":"#NUM!"},{"$error":"#NUM!"},{"$error":"#NUM!"},47.441050008873276,1.0586472250070716E-15,1.0586472250070716E-15,87.340100442375913,2.6204564174434334E-15,-21.388888888888857,7.6999999999999886,{"$error":"#NUM!"},0,0,0,-4.8781572544416297E-4,47.441050008873276,1.0586472250070716E-15,87.340100442375913,7.6999999999999886,1.7103722222222475E-5]
[7.6999999999999886,{"$error":"#NUM!"},{"$error":"#NUM!"},{"$error":"#NUM!"},3.7148658700887163,-3.7148658700887163,4.5512621809319574E-16,1.1706968128257578,{"$error":"#NUM!"},{"$error":"#NUM!"},{"$error":"#NUM!"},{"$error":"#NUM!"},47.441050008873276,1.0586472250070716E-15,1.0586472250070716E-15,87.340100442375913,2.6544883189686726E-15,-21.666666666666632,7.7999999999999883,{"$error":"#NUM!"},0,0,0,-4.2976040034923847E-4,47.441050008873276,1.0586472250070716E-15,87.340100442375913,7.7999999999999883,1.4747597222222469E-5]
[7.7999999999999883,{"$error":"#NUM!"},{"$error":"#NUM!"},{"$error":"#NUM!"},3.7148658700887163,-3.7148658700887163,4.5512621809319574E-16,1.1706968128257578,{"$error":"#NUM!"},{"$error":"#NUM!"},{"$error":"#NUM!"},{"$error":"#NUM!"},47.441050008873276,1.0586472250070716E-15,1.0586472250070716E-15,87.340100442375913,2.6885202204939118E-15,-21.944444444444411,7.8999999999999879,{"$error":"#NUM!"},0,0,0,-3.7397752640093722E-4,47.441050008873276,1.0586472250070716E-15,87.340100442375913,7.8999999999999879,1.2566000000000218E-5]
[7.8999999999999879,{"$error":"#NUM!"},{"$error":"#NUM!"},{"$error":"#NUM!"},3.7148658700887163,-3.7148658700887163,4.5512621809319574E-16,1.1706968128257578,{"$error":"#NUM!"},{"$error":"#NUM!"},{"$error":"#NUM!"},{"$error":"#NUM!"},47.441050008873276,1.0586472250070716E-15,1.0586472250070716E-15,87.340100442375913,2.7225521220191511E-15,-22.222222222222186,7.9999999999999876,{"$error":"#NUM!"},0,0,0,-3.2079173483976072E-4,47.441050008873276,1.0586472250070716E-15,87.340100442375913,7.9999999999999876,1.0558930555555768E-5]
[7.9999999999999876,{"$error":"#NUM!"},{"$error":"#NUM!"},{"$error":"#NUM!"},3.7148658700887163,-3.7148658700887163,4.5512621809319574E-16,1.1706968128257578,{"$error":"#NUM!"},{"$error":"#NUM!"},{"$error":"#NUM!"},{"$error":"#NUM!"},47.441050008873276,1.0586472250070716E-15,1.0586472250070716E-15,87.340100442375913,2.7565840235443907E-15,-22.499999999999964,8.0999999999999872,{"$error":"#NUM!"},0,0,0,-2.7052765690620809E-4,47.441050008873276,1.0586472250070716E-15,87.340100442375913,8.0999999999999872,8.7263888888890927E-6]
[8.0999999999999872,{"$error":"#NUM!"},{"$error":"#NUM!"},{"$error":"#NUM!"},3.7148658700887163,-3.7148658700887163,4.5512621809319574E-16,1.1706968128257578,{"$error":"#NUM!"},{"$error":"#NUM!"},{"$error":"#NUM!"},{"$error":"#NUM!"},47.441050008873276,1.0586472250070716E-15,1.0586472250070716E-15,87.340100442375913,2.7906159250696299E-15,-22.777777777777739,8.1999999999999869,{"$error":"#NUM!"},0,0,0,-2.2350992384077953E-4,47.441050008873276,1.0586472250070716E-15,87.340100442375913,8.1999999999999869,7.0683750000001922E-6]
[8.1999999999999869,{"$error":"#NUM!"},{"$error":"#NUM!"},{"$error":"#NUM!"},3.7148658700887163,-3.7148658700887163,4.5512621809319574E-16,1.1706968128257578,{"$error":"#NUM!"},{"$error":"#NUM!"},{"$error":"#NUM!"},{"$error":"#NUM!"},47.441050008873276,1.0586472250070716E-15,1.0586472250070716E-15,87.340100442375913,2.8246478265948691E-15,-23.055555555555518,8.2999999999999865,{"$error":"#NUM!"},0,0,0,-1.8006316688397449E-4,47.441050008873276,1.0586472250070716E-15,87.340100442375913,8.2999999999999865,5.5848888888890543E-6]
[8.2999999999999865,{"$error":"#NUM!"},{"$error":"#NUM!"},{"$error":"#NUM!"},3.7148658700887163,-3.7148658700887163,4.5512621809319574E-16,1.1706968128257578,{"$error":"#NUM!"},{"$error":"#NUM!"},{"$error":"#NUM!"},{"$error":"#NUM!"},47.441050008873276,1.0586472250070716E-15,1.0586472250070716E-15,87.340100442375913,2.8586797281201084E-15,-23.333333333333293,8.3999999999999861,{"$error":"#NUM!"},0,0,0,-1.4051201727629389E-4,47.441050008873276,1.0586472250070716E-15,87.340100442375913,8.3999999999999861,4.2759305555557078E-6]
[8.3999999999999861,{"$error":"#NUM!"},{"$error":"#NUM!"},{"$error":"#NUM!"},3.7148658700887163,-3.7148658700887163,4.5512621809319574E-16,1.1706968128257578,{"$error":"#NUM!"},{"$error":"#NUM!"},{"$error":"#NUM!"},{"$error":"#NUM!"},47.441050008873276,1.0586472250070716E-15,1.0586472250070716E-15,87.340100442375913,2.892711629645348E-15,-23.611111111111072,8.4999999999999858,{"$error":"#NUM!"},0,0,0,-1.0518110625823722E-4,47.441050008873276,1.0586472250070716E-15,87.340100442375913,8.4999999999999858,3.1415000000001363E-6]
[8.4999999999999858,{"$error":"#NUM!"},{"$error":"#NUM!"},{"$error":"#NUM!"},3.7148658700887163,-3.7148658700887163,4.5512621809319574E-16,1.1706968128257578,{"$error":"#NUM!"},{"$error":"#NUM!"},{"$error":"#NUM!"},{"$error":"#NUM!"},47.441050008873276,1.0586472250070716E-15,1.0586472250070716E-15,87.340100442375913,2.9267435311705872E-15,-23.888888888888847,8.5999999999999854,{"$error":"#NUM!"},0,0,0,-7.43950650703045E-5,47.441050008873276,1.0586472250070716E-15,87.340100442375913,8.5999999999999854,2.1815972222223414E-6]
[8.5999999999999854,{"$error":"#NUM!"},{"$error":"#NUM!"},{"$error":"#NUM!"},3.7148658700887163,-3.7148658700887163,4.5512621809319574E-16,1.1706968128257578,{"$error":"#NUM!"},{"$error":"#NUM!"},{"$error":"#NUM!"},{"$error":"#NUM!"},47.441050008873276,1.0586472250070716E-15,1.0586472250070716E-15,87.340100442375913,2.9607754326958264E-15,-24.166666666666625,8.6999999999999851,{"$error":"#NUM!"},0,0,0,-4.8478524952995481E-5,47.441050008873276,1.0586472250070716E-15,87.340100442375913,8.6999999999999851,1.3962222222223144E-6]
[8.6999999999999851,{"$error":"#NUM!"},{"$error":"#NUM!"},{"$error":"#NUM!"},3.7148658700887163,-3.7148658700887163,4.5512621809319574E-16,1.1706968128257578,{"$error":"#NUM!"},{"$error":"#NUM!"},{"$error":"#NUM!"},{"$error":"#NUM!"},47.441050008873276,1.0586472250070716E-15,1.0586472250070716E-15,87.340100442375913,2.9948073342210657E-15,-24.4444444444444,8.7999999999999847,{"$error":"#NUM!"},0,0,0,-2.7756117146810708E-5,47.441050008873276,1.0586472250070716E-15,87.340100442375913,8.7999999999999847,7.853750000000724E-7]
[8.7999999999999847,{"$error":"#NUM!"},{"$error":"#NUM!"},{"$error":"#NUM!"},3.7148658700887163,-3.7148658700887163,4.5512621809319574E-16,1.1706968128257578,{"$error":"#NUM!"},{"$error":"#NUM!"},{"$error":"#NUM!"},{"$error":"#NUM!"},47.441050008873276,1.0586472250070716E-15,1.0586472250070716E-15,87.340100442375913,3.0288392357463053E-15,-24.722222222222179,8.8999999999999844,{"$error":"#NUM!"},0,0,0,-1.2552472892249876E-5,47.441050008873276,1.0586472250070716E-15,87.340100442375913,8.8999999999999844,3.4905555555560586E-7]
[8.8999999999999844,{"$error":"#NUM!"},{"$error":"#NUM!"},{"$error":"#NUM!"},3.7148658700887163,-3.7148658700887163,4.5512621809319574E-16,1.1706968128257578,{"$error":"#NUM!"},{"$error":"#NUM!"},{"$error":"#NUM!"},{"$error":"#NUM!"},47.441050008873276,1.0586472250070716E-15,1.0586472250070716E-15,87.340100442375913,3.0628711372715445E-15,-24.999999999999954,8.999999999999984,{"$error":"#NUM!"},0,0,0,-3.1922234298129745E-6,47.441050008873276,1.0586472250070716E-15,87.340100442375913,8.999999999999984,8.7263888888915084E-8]
[8.999999999999984,{"$error":"#NUM!"},{"$error":"#NUM!"},{"$error":"#NUM!"},3.7148658700887163,-3.7148658700887163,4.5512621809319574E-16,1.1706968128257578,{"$error":"#NUM!"},{"$error":"#NUM!"},{"$error":"#NUM!"},{"$error":"#NUM!"},47.441050008873276,1.0586472250070716E-15,1.0586472250070716E-15,87.340100442375913,3.0969030387967837E-15,-25.277777777777732,9.0999999999999837,{"$error":"#NUM!"},0,0,0,-6.8930521873504262E-32,47.441050008873276,1.0586472250070716E-15,87.340100442375913,9.0999999999999837,1.8529071068395787E-33]
[9.0999999999999837,{"$error":"#NUM!"},{"$error":"#NUM!"},{"$error":"#NUM!"},3.7148658700887163,-3.7148658700887163,4.5512621809319574E-16,1.1706968128257578,{"$error":"#NUM!"},{"$error":"#NUM!"},{"$error":"#NUM!"},{"$error":"#NUM!"},47.441050008873276,1.0586472250070716E-15,1.0586472250070716E-15,87.340100442375913,3.130934940322023E-15,-25.555555555555507,9.1999999999999833,{"$error":"#NUM!"},0,0,0,-3.3004338433110151E-6,47.441050008873276,1.0586472250070716E-15,87.340100442375913,9.1999999999999833,8.7263888888862409E-8]
[9.1999999999999833,{"$error":"#NUM!"},{"$error":"#NUM!"},{"$error":"#NUM!"},3.7148658700887163,-3.7148658700887163,4.5512621809319574E-16,1.1706968128257578,{"$error":"#NUM!"},{"$error":"#NUM!"},{"$error":"#NUM!"},{"$error":"#NUM!"},47.441050008873276,1.0586472250070716E-15,1.0586472250070716E-15,87.340100442375913,3.1649668418472626E-15,-25.833333333333286,9.2999999999999829,{"$error":"#NUM!"},0,0,0,-1.3418156200245947E-5,47.441050008873276,1.0586472250070716E-15,87.340100442375913,9.2999999999999829,3.4905555555550046E-7]
[9.2999999999999829,{"$error":"#NUM!"},{"$error":"#NUM!"},{"$error":"#NUM!"},3.7148658700887163,-3.7148658700887163,4.5512621809319574E-16,1.1706968128257578,{"$error":"#NUM!"},{"$error":"#NUM!"},{"$error":"#NUM!"},{"$error":"#NUM!"},47.441050008873276,1.0586472250070716E-15,1.0586472250070716E-15,87.340100442375913,3.1989987433725018E-15,-26.111111111111061,9.3999999999999826,{"$error":"#NUM!"},0,0,0,-3.0677798311304795E-5,47.441050008873276,1.0586472250070716E-15,87.340100442375913,9.3999999999999826,7.8537499999991421E-7]
[9.3999999999999826,{"$error":"#NUM!"},{"$error":"#NUM!"},{"$error":"#NUM!"},3.7148658700887163,-3.7148658700887163,4.5512621809319574E-16,1.1706968128257578,{"$error":"#NUM!"},{"$error":"#NUM!"},{"$error":"#NUM!"},{"$error":"#NUM!"},47.441050008873276,1.0586472250070716E-15,1.0586472250070716E-15,87.340100442375913,3.233030644897741E-15,-26.38888888888884,9.4999999999999822,{"$error":"#NUM!"},0,0,0,-5.5403991416987553E-5,47.441050008873276,1.0586472250070716E-15,87.340100442375913,9.4999999999999822,1.3962222222221037E-6]
[9.4999999999999822,{"$error":"#NUM!"},{"$error":"#NUM!"},{"$error":"#NUM!"},3.7148658700887163,-3.7148658700887163,4.5512621809319574E-16,1.1706968128257578,{"$error":"#NUM!"},{"$error":"#NUM!"},{"$error":"#NUM!"},{"$error":"#NUM!"},47.441050008873276,1.0586472250070716E-15,1.0586472250070716E-15,87.340100442375913,3.2670625464229803E-15,-26.666666666666615,9.5999999999999819,{"$error":"#NUM!"},0,0,0,{"$f":"IF($B$24=\"C\",IF((3.14159265*1860/4)*((0.001*$B$18)-(2*$B$26*A126))^2*((0.33333*0.001*$B$18)-(2*$B$26*A126))<0,(3.14159265*1860/4)*((0.001*$B$18)-(2*$B$26*A126))^2*((0.33333*0.001*$B$18)-(2*$B$26*A126)),(3.14159265*1860/4)*((0.001*$B$18)-(2*$B$26*A126))^2*((0.33333*0.001*$B$18)-(2*$B$26*A126))),$B$19)","v":-8.7921366757794206E-5},47.441050008873276,1.0586472250070716E-15,87.340100442375913,9.5999999999999819,2.1815972222220686E-6]
[9.5999999999999819,{"$error":"#NUM!"},{"$error":"#NUM!"},{"$error":"#NUM!"},3.7148658700887163,-3.7148658700887163,4.5512621809319574E-16,1.1706968128257578,{"$error":"#NUM!"},{"$error":"#NUM!"},{"$error":"#NUM!"},{"$error":"#NUM!"},47.441050008873276,1.0586472250070716E-15,1.0586472250070716E-15,87.340100442375913,3.3010944479482199E-15,-26.944444444444393,9.6999999999999815,{"$error":"#NUM!"},0,0,0,-1.2855455557422477E-4,47.441050008873276,1.0586472250070716E-15,87.340100442375913,9.6999999999999815,3.1414999999998097E-6]
[9.6999999999999815,{"$error":"#NUM!"},{"$error":"#NUM!"},{"$error":"#NUM!"},3.7148658700887163,-3.7148658700887163,4.5512621809319574E-16,1.1706968128257578,{"$error":"#NUM!"},{"$error":"#NUM!"},{"$error":"#NUM!"},{"$error":"#NUM!"},47.441050008873276,1.0586472250070716E-15,1.0586472250070716E-15,87.340100442375913,3.3351263494734591E-15,-27.222222222222168,9.7999999999999812,{"$error":"#NUM!"},0,0,0,-1.776281891067803E-4,47.441050008873276,1.0586472250070716E-15,87.340100442375913,9.7999999999999812,4.2759305555553512E-6]
[9.7999999999999812,{"$error":"#NUM!"},{"$error":"#NUM!"},{"$error":"#NUM!"},3.7148658700887163,-3.7148658700887163,4.5512621809319574E-16,1.1706968128257578,{"$error":"#NUM!"},{"$error":"#NUM!"},{"$error":"#NUM!"},{"$error":"#NUM!"},47.441050008873276,1.0586472250070716E-15,1.0586472250070716E-15,87.340100442375913,3.3691582509986983E-15,-27.499999999999947,9.8999999999999808,{"$error":"#NUM!"},0,0,0,-2.354668985959588E-4,47.441050008873276,1.0586472250070716E-15,87.340100442375913,9.8999999999999808,5.5848888888886468E-6]
[9.8999999999999808,{"$error":"#NUM!"},{"$error":"#NUM!"},{"$error":"#NUM!"},3.7148658700887163,-3.7148658700887163,4.5512621809319574E-16,1.1706968128257578,{"$error":"#NUM!"},{"$error":"#NUM!"},{"$error":"#NUM!"},{"$error":"#NUM!"},47.441050008873276,1.0586472250070716E-15,1.0586472250070716E-15,87.340100442375913,3.4031901525239375E-15,-27.777777777777722,9.9999999999999805,{"$error":"#NUM!"},0,0,0,-3.0239531528226119E-4,47.441050008873276,1.0586472250070716E-15,87.340100442375913,9.9999999999999805,7.0683749999997187E-6]
[9.9999999999999805,{"$error":"#NUM!"},{"$error":"#NUM!"},{"$error":"#NUM!"},3.7148658700887163,-3.7148658700887163,4.5512621809319574E-16,1.1706968128257578,{"$error":"#NUM!"},{"$error":"#NUM!"},{"$error":"#NUM!"},{"$error":"#NUM!"},47.441050008873276,1.0586472250070716E-15,1.0586472250070716E-15,87.340100442375913,3.4372220540491772E-15,-28.0555555555555,10.09999999999998,{"$error":"#NUM!"},0,0,0,-3.7873807040618749E-4,47.441050008873276,1.0586472250070716E-15,87.340100442375913,10.09999999999998,8.7263888888885659E-6]
[10.09999999999998,{"$error":"#NUM!"},{"$error":"#NUM!"},{"$error":"#NUM!"},3.7148658700887163,-3.7148658700887163,4.5512621809319574E-16,1.1706968128257578,{"$error":"#NUM!"},{"$error":"#NUM!"},{"$error":"#NUM!"},{"$error":"#NUM!"},47.441050008873276,1.0586472250070716E-15,1.0586472250070716E-15,87.340100442375913,3.4712539555744164E-15,-28.333333333333275,10.19999999999998,{"$error":"#NUM!"},0,0,0,-4.6481979520823758E-4,47.441050008873276,1.0586472250070716E-15,87.340100442375913,10.19999999999998,1.0558930555555188E-5]
[10.19999999999998,{"$error":"#NUM!"},{"$error":"#NUM!"},{"$error":"#NUM!"},3.7148658700887163,-3.7148658700887163,4.5512621809319574E-16,1.1706968128257578,{"$error":"#NUM!"},{"$error":"#NUM!"},{"$error":"#NUM!"},{"$error":"#NUM!"},47.441050008873276,1.0586472250070716E-15,1.0586472250070716E-15,87.340100442375913,3.5052858570996556E-15,-28.611111111111054,10.299999999999979,{"$error":"#NUM!"},0,0,0,-5.6096512092891171E-4,47.441050008873276,1.0586472250070716E-15,87.340100442375913,10.299999999999979,1.2565999999999588E-5]
[10.299999999999979,{"$error":"#NUM!"},{"$error":"#NUM!"},{"$error":"#NUM!"},3.7148658700887163,-3.7148658700887163,4.5512621809319574E-16,1.1706968128257578,{"$error":"#NUM!"},{"$error":"#NUM!"},{"$error":"#NUM!"},{"$error":"#NUM!"},47.441050008873276,1.0586472250070716E-15,1.0586472250070716E-15,87.340100442375913,3.5393177586248948E-15,-28.888888888888829,10.399999999999979,{"$error":"#NUM!"},0,0,0,-6.6749867880870953E-4,47.441050008873276,1.0586472250070716E-15,87.340100442375913,10.399999999999979,1.4747597222221763E-5]
[10.399999999999979,{"$error":"#NUM!"},{"$error":"#NUM!"},{"$error":"#NUM!"},3.7148658700887163,-3.7148658700887163,4.5512621809319574E-16,1.1706968128257578,{"$error":"#NUM!"},{"$error":"#NUM!"},{"$error":"#NUM!"},{"$error":"#NUM!"},47.441050008873276,1.0586472250070716E-15,1.0586472250070716E-15,87.340100442375913,3.5733496601501341E-15,-29.166666666666607,10.499999999999979,{"$error":"#NUM!"},0,0,0,-7.8474510008813114E-4,47.441050008873276,1.0586472250070716E-15,87.340100442375913,10.499999999999979,1.710372222222171E-5]
[10.499999999999979,{"$error":"#NUM!"},{"$error":"#NUM!"},{"$error":"#NUM!"},3.7148658700887163,-3.7148658700887163,4.5512621809319574E-16,1.1706968128257578,{"$error":"#NUM!"},{"$error":"#NUM!"},{"$error":"#NUM!"},{"$error":"#NUM!"},47.441050008873276,1.0586472250070716E-15,1.0586472250070716E-15,87.340100442375913,3.6073815616753737E-15,-29.444444444444382,10.599999999999978,{"$error":"#NUM!"},0,0,0,-9.1302901600767955E-4,47.441050008873276,1.0586472250070716E-15,87.340100442375913,10.599999999999978,1.963437499999949E-5]
[10.599999999999978,{"$error":"#NUM!"},{"$error":"#NUM!"},{"$error":"#NUM!"},3.7148658700887163,-3.7148658700887163,4.5512621809319574E-16,1.1706968128257578,{"$error":"#NUM!"},{"$error":"#NUM!"},{"$error":"#NUM!"},{"$error":"#NUM!"},47.441050008873276,1.0586472250070716E-15,1.0586472250070716E-15,87.340100442375913,3.6414134632006133E-15,-29.722222222222161,10.699999999999978,{"$error":"#NUM!"},0,0,0,-1.0526750578078493E-3,47.441050008873276,1.0586472250070716E-15,87.340100442375913,10.699999999999978,2.2339555555554994E-5]
[10.699999999999978,{"$error":"#NUM!"},{"$error":"#NUM!"},{"$error":"#NUM!"},3.7148658700887163,-3.7148658700887163,4.5512621809319574E-16,1.1706968128257578,{"$error":"#NUM!"},{"$error":"#NUM!"},{"$error":"#NUM!"},{"$error":"#NUM!"},47.441050008873276,1.0586472250070716E-15,1.0586472250070716E-15,87.340100442375913,3.6754453647258521E-15,-29.999999999999936,10.799999999999978,{"$error":"#NUM!"},0,0,0,-1.2040078567291427E-3,47.441050008873276,1.0586472250070716E-15,87.340100442375913,10.799999999999978,2.5219263888888274E-5]
[10.799999999999978,{"$error":"#NUM!"},{"$error":"#NUM!"},{"$error":"#NUM!"},3.7148658700887163,-3.7148658700887163,4.5512621809319574E-16,1.1706968128257578,{"$error":"#NUM!"},{"$error":"#NUM!"},{"$error":"#NUM!"},{"$error":"#NUM!"},47.441050008873276,1.0586472250070716E-15,1.0586472250070716E-15,87.340100442375913,3.7094772662510918E-15,-30.277777777777715,10.899999999999977,{"$error":"#NUM!"},0,0,0,-1.3673520440120601E-3,47.441050008873276,1.0586472250070716E-15,87.340100442375913,10.899999999999977,2.8273499999999332E-5]
[10.899999999999977,{"$error":"#NUM!"},{"$error":"#NUM!"},{"$error":"#NUM!"},3.7148658700887163,-3.7148658700887163,4.5512621809319574E-16,1.1706968128257578,{"$error":"#NUM!"},{"$error":"#NUM!"},{"$error":"#NUM!"},{"$error":"#NUM!"},47.441050008873276,1.0586472250070716E-15,1.0586472250070716E-15,87.340100442375913,3.7435091677763306E-15,-30.55555555555549,10.999999999999977,{"$error":"#NUM!"},0,0,0,-1.5430322508971012E-3,47.441050008873276,1.0586472250070716E-15,87.340100442375913,10.999999999999977,3.1502263888888163E-5]
[10.999999999999977,{"$error":"#NUM!"},{"$error":"#NUM!"},{"$error":"#NUM!"},3.7148658700887163,-3.7148658700887163,4.5512621809319574E-16,1.1706968128257578,{"$error":"#NUM!"},{"$error":"#NUM!"},{"$error":"#NUM!"},{"$error":"#NUM!"},47.441050008873276,1.0586472250070716E-15,1.0586472250070716E-15,87.340100442375913,3.7775410693015702E-15,-30.833333333333268,11.099999999999977,{"$error":"#NUM!"},0,0,0,-1.7313731086247663E-3,47.441050008873276,1.0586472250070716E-15,87.340100442375913,11.099999999999977,3.4905555555554772E-5]
[11.099999999999977,{"$error":"#NUM!"},{"$error":"#NUM!"},{"$error":"#NUM!"},3.7148658700887163,-3.7148658700887163,4.5512621809319574E-16,1.1706968128257578,{"$error":"#NUM!"},{"$error":"#NUM!"},{"$error":"#NUM!"},{"$error":"#NUM!"},47.441050008873276,1.0586472250070716E-15,1.0586472250070716E-15,87.340100442375913,3.8115729708268098E-15,-31.111111111111043,11.199999999999976,{"$error":"#NUM!"},0,0,0,-1.9326992484355551E-3,47.441050008873276,1.0586472250070716E-15,87.340100442375913,11.199999999999976,3.8483374999999156E-5]
[11.199999999999976,{"$error":"#NUM!"},{"$error":"#NUM!"},{"$error":"#NUM!"},3.7148658700887163,-3.7148658700887163,4.5512621809319574E-16,1.1706968128257578,{"$error":"#NUM!"},{"$error":"#NUM!"},{"$error":"#NUM!"},{"$error":"#NUM!"},47.441050008873276,1.0586472250070716E-15,1.0586472250070716E-15,87.340100442375913,3.8456048723520487E-15,-31.388888888888822,11.299999999999976,{"$error":"#NUM!"},0,0,0,-2.1473353015699676E-3,47.441050008873276,1.0586472250070716E-15,87.340100442375913,11.299999999999976,4.2235722222221309E-5]
[11.299999999999976,{"$error":"#NUM!"},{"$error":"#NUM!"},{"$error":"#NUM!"},3.7148658700887163,-3.7148658700887163,4.5512621809319574E-16,1.1706968128257578,{"$error":"#NUM!"},{"$error":"#NUM!"},{"$error":"#NUM!"},{"$error":"#NUM!"},47.441050008873276,1.0586472250070716E-15,1.0586472250070716E-15,87.340100442375913,3.8796367738772883E-15,-31.666666666666597,11.399999999999975,{"$error":"#NUM!"},0,0,0,-2.3756058992685093E-3,47.441050008873276,1.0586472250070716E-15,87.340100442375913,11.399999999999975,4.6162597222221333E-5]
[11.399999999999975,{"$error":"#NUM!"},{"$error":"#NUM!"},{"$error":"#NUM!"},3.7148658700887163,-3.7148658700887163,4.5512621809319574E-16,1.1706968128257578,{"$error":"#NUM!"},{"$error":"#NUM!"},{"$error":"#NUM!"},{"$error":"#NUM!"},47.441050008873276,1.0586472250070716E-15,1.0586472250070716E-15,87.340100442375913,3.9136686754025279E-15,-31.944444444444375,11.499999999999975,{"$error":"#NUM!"},0,0,0,-2.6178356727716693E-3,47.441050008873276,1.0586472250070716E-15,87.340100442375913,11.499999999999975,5.0263999999999043E-5]
[11.499999999999975,{"$error":"#NUM!"},{"$error":"#NUM!"},{"$error":"#NUM!"},3.7148658700887163,-3.7148658700887163,4.5512621809319574E-16,1.1706968128257578,{"$error":"#NUM!"},{"$error":"#NUM!"},{"$error":"#NUM!"},{"$error":"#NUM!"},47.441050008873276,1.0586472250070716E-15,1.0586472250070716E-15,87.340100442375913,3.9477005769277667E-15,-32.22222222222215,11.599999999999975,{"$error":"#NUM!"},0,0,0,-2.874349253319954E-3,47.441050008873276,1.0586472250070716E-15,87.340100442375913,11.599999999999975,5.4539930555554536E-5]
[11.599999999999975,{"$error":"#NUM!"},{"$error":"#NUM!"},{"$error":"#NUM!"},3.7148658700887163,-3.7148658700887163,4.5512621809319574E-16,1.1706968128257578,{"$error":"#NUM!"},{"$error":"#NUM!"},{"$error":"#NUM!"},{"$error":"#NUM!"},47.441050008873276,1.0586472250070716E-15,1.0586472250070716E-15,87.340100442375913,3.9817324784530064E-15,-32.499999999999929,11.699999999999974,{"$error":"#NUM!"},0,0,0,-3.1454712721538623E-3,47.441050008873276,1.0586472250070716E-15,87.340100442375913,11.699999999999974,5.8990388888887804E-5]
[11.699999999999974,{"$error":"#NUM!"},{"$error":"#NUM!"},{"$error":"#NUM!"},3.7148658700887163,-3.7148658700887163,4.5512621809319574E-16,1.1706968128257578,{"$error":"#NUM!"},{"$error":"#NUM!"},{"$error":"#NUM!"},{"$error":"#NUM!"},47.441050008873276,1.0586472250070716E-15,1.0586472250070716E-15,87.340100442375913,4.015764379978246E-15,-32.777777777777708,11.799999999999974,{"$error":"#NUM!"},0,0,0,-3.4315263605138942E-3,47.441050008873276,1.0586472250070716E-15,87.340100442375913,11.799999999999974,6.3615374999998847E-5]
[11.799999999999974,{"$error":"#NUM!"},{"$error":"#NUM!"},{"$error":"#NUM!"},3.7148658700887163,-3.7148658700887163,4.5512621809319574E-16,1.1706968128257578,{"$error":"#NUM!"},{"$error":"#NUM!"},{"$error":"#NUM!"},{"$error":"#NUM!"},47.441050008873276,1.0586472250070716E-15,1.0586472250070716E-15,87.340100442375913,4.0497962815034848E-15,-33.055555555555479,11.899999999999974,{"$error":"#NUM!"},0,0,0,-3.7328391496405499E-3,47.441050008873276,1.0586472250070716E-15,87.340100442375913,11.899999999999974,6.8414888888887666E-5]
[11.899999999999974,{"$error":"#NUM!"},{"$error":"#NUM!"},{"$error":"#NUM!"},3.7148658700887163,-3.7148658700887163,4.5512621809319574E-16,1.1706968128257578,{"$error":"#NUM!"},{"$error":"#NUM!"},{"$error":"#NUM!"},{"$error":"#NUM!"},47.441050008873276,1.0586472250070716E-15,1.0586472250070716E-15,87.340100442375913,4.0838281830287244E-15,-33.333333333333258,11.999999999999973,{"$error":"#NUM!"},0,0,0,-4.0497342707743293E-3,47.441050008873276,1.0586472250070716E-15,87.340100442375913,11.999999999999973,7.3388930555554253E-5]
[11.999999999999973,{"$error":"#NUM!"},{"$error":"#NUM!"},{"$error":"#NUM!"},3.7148658700887163,-3.7148658700887163,4.5512621809319574E-16,1.1706968128257578,{"$error":"#NUM!"},{"$error":"#NUM!"},{"$error":"#NUM!"},{"$error":"#NUM!"},47.441050008873276,1.0586472250070716E-15,1.0586472250070716E-15,87.340100442375913,4.1178600845539633E-15,-33.611111111111036,12.099999999999973,{"$error":"#NUM!"},0,0,0,-4.3825363551557323E-3,47.441050008873276,1.0586472250070716E-15,87.340100442375913,12.099999999999973,7.8537499999998609E-5]
[12.099999999999973,{"$error":"#NUM!"},{"$error":"#NUM!"},{"$error":"#NUM!"},3.7148658700887163,-3.7148658700887163,4.5512621809319574E-16,1.1706968128257578,{"$error":"#NUM!"},{"$error":"#NUM!"},{"$error":"#NUM!"},{"$error":"#NUM!"},47.441050008873276,1.0586472250070716E-15,1.0586472250070716E-15,87.340100442375913,4.1518919860792029E-15,-33.888888888888815,12.199999999999973,{"$error":"#NUM!"},0,0,0,-4.7315700340252679E-3,47.441050008873276,1.0586472250070716E-15,87.340100442375913,12.199999999999973,8.3860597222220882E-5]
[12.199999999999973,{"$error":"#NUM!"},{"$error":"#NUM!"},{"$error":"#NUM!"},3.7148658700887163,-3.7148658700887163,4.5512621809319574E-16,1.1706968128257578,{"$error":"#NUM!"},{"$error":"#NUM!"},{"$error":"#NUM!"},{"$error":"#NUM!"},47.441050008873276,1.0586472250070716E-15,1.0586472250070716E-15,87.340100442375913,4.1859238876044417E-15,-34.166666666666586,12.299999999999972,{"$error":"#NUM!"},0,0,0,-5.0971599386234181E-3,47.441050008873276,1.0586472250070716E-15,87.340100442375913,12.299999999999972,8.9358222222220803E-5]
[12.299999999999972,{"$error":"#NUM!"},{"$error":"#NUM!"},{"$error":"#NUM!"},3.7148658700887163,-3.7148658700887163,4.5512621809319574E-16,1.1706968128257578,{"$error":"#NUM!"},{"$error":"#NUM!"},{"$error":"#NUM!"},{"$error":"#NUM!"},47.441050008873276,1.0586472250070716E-15,1.0586472250070716E-15,87.340100442375913,4.2199557891296813E-15,-34.444444444444365,12.399999999999972,{"$error":"#NUM!"},0,0,0,-5.4796307001906928E-3,47.441050008873276,1.0586472250070716E-15,87.340100442375913,12.399999999999972,9.5030374999998491E-5]
[12.399999999999972,{"$error":"#NUM!"},{"$error":"#NUM!"},{"$error":"#NUM!"},3.7148658700887163,-3.7148658700887163,4.5512621809319574E-16,1.1706968128257578,{"$error":"#NUM!"},{"$error":"#NUM!"},{"$error":"#NUM!"},{"$error":"#NUM!"},47.441050008873276,1.0586472250070716E-15,1.0586472250070716E-15,87.340100442375913,4.253987690654921E-15,-34.722222222222143,12.499999999999972,{"$error":"#NUM!"},0,0,0,-5.8793069499675924E-3,47.441050008873276,1.0586472250070716E-15,{"$f":"IF(X155<=0,P155,0)","v":87.340100442375913},12.499999999999972,1.0087705555555398E-4]
[12.499999999999972,{"$error":"#NUM!"},{"$error":"#NUM!"},{"$error":"#NUM!"},3.7148658700887163,-3.7148658700887163,4.5512621809319574E-16,1.1706968128257578,{"$error":"#NUM!"},{"$error":"#NUM!"},{"$error":"#NUM!"},{"$error":"#NUM!"},47.441050008873276,1.0586472250070716E-15,1.0586472250070716E-15,87.340100442375913,4.2880195921801606E-15,-34.999999999999922,12.599999999999971,{"$error":"#NUM!"},0,0,0,-6.2965133191946144E-3,47.441050008873276,1.0586472250070716E-15,87.340100442375913,12.599999999999971,1.0689826388888723E-4]
[12.599999999999971,{"$error":"#NUM!"},{"$error":"#NUM!"},{"$error":"#NUM!"},3.7148658700887163,-3.7148658700887163,4.5512621809319574E-16,1.1706968128257578,{"$error":"#NUM!"},{"$error":"#NUM!"},{"$error":"#NUM!"},{"$error":"#NUM!"},47.441050008873276,1.0586472250070716E-15,1.0586472250070716E-15,87.340100442375913,4.3220514937053994E-15,-35.277777777777693,12.699999999999971,{"$error":"#NUM!"},0,0,0,-6.7315744391122602E-3,47.441050008873276,1.0586472250070716E-15,87.340100442375913,12.699999999999971,1.1309399999999824E-4]
[12.699999999999971,{"$error":"#NUM!"},{"$error":"#NUM!"},{"$error":"#NUM!"},3.7148658700887163,-3.7148658700887163,4.5512621809319574E-16,1.1706968128257578,{"$error":"#NUM!"},{"$error":"#NUM!"},{"$error":"#NUM!"},{"$error":"#NUM!"},47.441050008873276,1.0586472250070716E-15,1.0586472250070716E-15,87.340100442375913,4.356083395230639E-15,-35.555555555555472,12.799999999999971,{"$error":"#NUM!"},0,0,0,-7.1848149409610299E-3,47.441050008873276,1.0586472250070716E-15,87.340100442375913,12.799999999999971,1.1946426388888704E-4]
[12.799999999999971,{"$error":"#NUM!"},{"$error":"#NUM!"},{"$error":"#NUM!"},3.7148658700887163,-3.7148658700887163,4.5512621809319574E-16,1.1706968128257578,{"$f":"SQRT(((B159-F159)^2)+((C159-G159)^2)+(D159^2))","v":{"$error":"#NUM!"}},{"$error":"#NUM!"},{"$error":"#NUM!"},{"$error":"#NUM!"},47.441050008873276,1.0586472250070716E-15,{"$f":"ABS(N159)","v":1.0586472250070716E-15},87.340100442375913,4.3901152967558779E-15,-35.83333333333325,12.89999999999997,{"$error":"#NUM!"},0,0,0,-7.6565594559814239E-3,47.441050008873276,1.0586472250070716E-15,87.340100442375913,12.89999999999997,1.2600905555555363E-4]
[{"$f":"A159+$B$22","v":12.89999999999997},{"$f":"B159+(J159*$B$22)","v":{"$error":"#NUM!"}},{"$f":"C159+(K159*$B$22)","v":{"$error":"#NUM!"}},{"$f":"D159+(L159*$B$22)","v":{"$error":"#NUM!"}},{"$f":"IF($B$13=2,$B$23*((0.1036*LN(ABS(P159+1)))+0.8731),IF($B$13=3,$B$23*((0.139*LN(ABS(P159+1)))+0.7503),$B$23))","v":3.7148658700887163},{"$f":"E160*COS(RADIANS($B$10))","v":-3.7148658700887163},{"$f":"E160*SIN(RADIANS($B$10))","v":4.5512621809319574E-16},{"$f":"1.22*EXP(-0.0001065*(P159+$B$12))","v":1.1706968128257578},{"$error":"#NUM!"},{"$error":"#NUM!"},{"$error":"#NUM!"},{"$error":"#NUM!"},{"$f":"IF(X160>0,IF(P159<=Param_1,M159,M159+(B161*$B$22)),M159)","v":47.441050008873276},{"$f":"IF(X160>0,IF(P159<=Param_1,N159,N159+(C161*$B$22)),N159)","v":1.0586472250070716E-15},1.0586472250070716E-15,{"$f":"IF(X160>0,IF(P159<Param_1,P159,P159+(D161*$B$22)),P159)","v":87.340100442375913},{"$f":"IF(P159<Param_1,Q159,A161*$B$23*SIN(RADIANS($B$10)))","v":4.4241471982811175E-15},{"$f":"IF(P159<Param_1,R159,A161*$B$23*COS(RADIANS($B$10)))","v":-36.111111111111029},{"$f":"IF(P159<Param_1,S159,A161)","v":12.99999999999997},{"$error":"#NUM!"},0,0,0,-8.1471326154139521E-3,{"$f":"IF(X160<=0,M160,0)","v":47.441050008873276},{"$f":"IF(X160<=0,N160,0)","v":1.0586472250070716E-15},87.340100442375913,{"$f":"IF(X160<=0,S160,3000)","v":12.99999999999997},{"$f":"IF($B$24=\"S\",$B$20,3.1415*(($B$18*0.0005)-($B$26*A160))^2)","v":1.3272837499999813E-4}]
[12.99999999999997,{"$error":"#NUM!"},{"$error":"#NUM!"},{"$error":"#NUM!"},3.7148658700887163,-3.7148658700887163,4.5512621809319574E-16,1.1706968128257578,{"$error":"#NUM!"},{"$f":"-0.5*H161*I161*AC161*$B$17*(B161-F161)/X161","v":{"$error":"#NUM!"}},{"$f":"-0.5*H161*I161*AC161*$B$17*(C161-G161)/X161","v":{"$error":"#NUM!"}},{"$f":"(-0.5*H161*AC161*I161*$B$17*D161/X161)-$B$21","v":{"$error":"#NUM!"}},47.441050008873276,1.0586472250070716E-15,1.0586472250070716E-15,87.340100442375913,4.4581790998063563E-15,-36.3888888888888,13.099999999999969,{"$f":"IF(D161<0,T160,A162)","v":{"$error":"#NUM!"}},{"$f":"IF(ROUND(A161*10,3)=$B$14*10,M161,0)","v":0},{"$f":"IF(ROUND(A161*10,3)=$B$14*10,N161,0)","v":0},{"$f":"IF(ROUND(A161*10,3)=$B$14*10,P161,0)","v":0},-8.6568590504990939E-3,47.441050008873276,1.0586472250070716E-15,87.340100442375913,13.099999999999969,1.3962222222222025E-4]
[13.099999999999969,{"$error":"#NUM!"},{"$error":"#NUM!"},{"$error":"#NUM!"},3.7148658700887163,-3.7148658700887163,4.5512621809319574E-16,1.1706968128257578,{"$error":"#NUM!"},{"$error":"#NUM!"},{"$error":"#NUM!"},{"$error":"#NUM!"},47.441050008873276,1.0586472250070716E-15,1.0586472250070716E-15,87.340100442375913,4.4922110013315959E-15,-36.666666666666579,13.199999999999969,{"$error":"#NUM!"},0,0,0,-9.1860633924773592E-3,47.441050008873276,1.0586472250070716E-15,87.340100442375913,13.199999999999969,1.4669059722222016E-4]
[13.199999999999969,{"$error":"#NUM!"},{"$error":"#NUM!"},{"$error":"#NUM!"},3.7148658700887163,-3.7148658700887163,4.5512621809319574E-16,1.1706968128257578,{"$error":"#NUM!"},{"$error":"#NUM!"},{"$error":"#NUM!"},{"$error":"#NUM!"},47.441050008873276,1.0586472250070716E-15,1.0586472250070716E-15,87.340100442375913,4.5262429028568355E-15,-36.944444444444358,13.299999999999969,{"$error":"#NUM!"},0,0,0,-9.7350702725892465E-3,47.441050008873276,1.0586472250070716E-15,87.340100442375913,13.299999999999969,1.5393349999999784E-4]
[13.299999999999969,{"$error":"#NUM!"},{"$error":"#NUM!"},{"$error":"#NUM!"},3.7148658700887163,-3.7148658700887163,4.5512621809319574E-16,1.1706968128257578,{"$error":"#NUM!"},{"$error":"#NUM!"},{"$error":"#NUM!"},{"$error":"#NUM!"},47.441050008873276,1.0586472250070716E-15,1.0586472250070716E-15,87.340100442375913,4.5602748043820752E-15,-37.222222222222136,13.399999999999968,{"$error":"#NUM!"},0,0,0,-1.030420432207526E-2,47.441050008873276,1.0586472250070716E-15,87.340100442375913,13.399999999999968,1.6135093055555329E-4]
[13.399999999999968,{"$error":"#NUM!"},{"$error":"#NUM!"},{"$error":"#NUM!"},3.7148658700887163,-3.7148658700887163,4.5512621809319574E-16,1.1706968128257578,{"$error":"#NUM!"},{"$error":"#NUM!"},{"$error":"#NUM!"},{"$error":"#NUM!"},47.441050008873276,1.0586472250070716E-15,1.0586472250070716E-15,87.340100442375913,4.594306705907314E-15,-37.499999999999908,13.499999999999968,{"$error":"#NUM!"},0,0,0,-1.0893790172175895E-2,47.441050008873276,1.0586472250070716E-15,87.340100442375913,13.499999999999968,1.6894288888888651E-4]
[13.499999999999968,{"$error":"#NUM!"},{"$error":"#NUM!"},{"$error":"#NUM!"},3.7148658700887163,-3.7148658700887163,4.5512621809319574E-16,1.1706968128257578,{"$error":"#NUM!"},{"$error":"#NUM!"},{"$error":"#NUM!"},{"$error":"#NUM!"},47.441050008873276,1.0586472250070716E-15,1.0586472250070716E-15,87.340100442375913,4.6283386074325536E-15,-37.777777777777686,13.599999999999968,{"$error":"#NUM!"},0,0,0,-1.1504152454131656E-2,47.441050008873276,1.0586472250070716E-15,87.340100442375913,13.599999999999968,1.7670937499999754E-4]
[13.599999999999968,{"$error":"#NUM!"},{"$error":"#NUM!"},{"$error":"#NUM!"},3.7148658700887163,-3.7148658700887163,4.5512621809319574E-16,1.1706968128257578,{"$error":"#NUM!"},{"$error":"#NUM!"},{"$error":"#NUM!"},{"$error":"#NUM!"},47.441050008873276,1.0586472250070716E-15,1.0586472250070716E-15,87.340100442375913,4.6623705089577924E-15,-38.055555555555465,13.699999999999967,{"$error":"#NUM!"},0,0,0,-1.213561579918304E-2,47.441050008873276,1.0586472250070716E-15,87.340100442375913,13.699999999999967,1.8465038888888633E-4]
[13.699999999999967,{"$error":"#NUM!"},{"$error":"#NUM!"},{"$error":"#NUM!"},3.7148658700887163,-3.7148658700887163,4.5512621809319574E-16,1.1706968128257578,{"$error":"#NUM!"},{"$error":"#NUM!"},{"$error":"#NUM!"},{"$error":"#NUM!"},47.441050008873276,1.0586472250070716E-15,1.0586472250070716E-15,87.340100442375913,4.6964024104830321E-15,-38.333333333333243,13.799999999999967,{"$error":"#NUM!"},0,0,0,-1.2788504838570561E-2,47.441050008873276,1.0586472250070716E-15,87.340100442375913,13.799999999999967,1.9276593055555307E-4]
[13.799999999999967,{"$error":"#NUM!"},{"$error":"#NUM!"},{"$error":"#NUM!"},3.7148658700887163,-3.7148658700887163,4.5512621809319574E-16,1.1706968128257578,{"$error":"#NUM!"},{"$error":"#NUM!"},{"$error":"#NUM!"},{"$error":"#NUM!"},47.441050008873276,1.0586472250070716E-15,1.0586472250070716E-15,87.340100442375913,4.7304343120082709E-15,-38.611111111111015,13.899999999999967,{"$error":"#NUM!"},0,0,0,-1.3463144203534694E-2,47.441050008873276,1.0586472250070716E-15,87.340100442375913,13.899999999999967,2.0105599999999739E-4]
[13.899999999999967,{"$error":"#NUM!"},{"$error":"#NUM!"},{"$error":"#NUM!"},3.7148658700887163,-3.7148658700887163,4.5512621809319574E-16,1.1706968128257578,{"$error":"#NUM!"},{"$error":"#NUM!"},{"$error":"#NUM!"},{"$error":"#NUM!"},47.441050008873276,1.0586472250070716E-15,1.0586472250070716E-15,87.340100442375913,4.7644662135335105E-15,-38.888888888888793,13.999999999999966,{"$error":"#NUM!"},0,0,0,-1.415985852531595E-2,47.441050008873276,1.0586472250070716E-15,87.340100442375913,13.999999999999966,2.095205972222195E-4]
[13.999999999999966,{"$error":"#NUM!"},{"$error":"#NUM!"},{"$error":"#NUM!"},3.7148658700887163,-3.7148658700887163,4.5512621809319574E-16,1.1706968128257578,{"$error":"#NUM!"},{"$error":"#NUM!"},{"$error":"#NUM!"},{"$error":"#NUM!"},47.441050008873276,1.0586472250070716E-15,1.0586472250070716E-15,87.340100442375913,4.7984981150587501E-15,-39.166666666666572,14.099999999999966,{"$error":"#NUM!"},0,0,0,-1.4878972435154828E-2,47.441050008873276,1.0586472250070716E-15,87.340100442375913,14.099999999999966,2.1815972222221942E-4]
[14.099999999999966,{"$error":"#NUM!"},{"$error":"#NUM!"},{"$error":"#NUM!"},3.7148658700887163,-3.7148658700887163,4.5512621809319574E-16,1.1706968128257578,{"$error":"#NUM!"},{"$error":"#NUM!"},{"$error":"#NUM!"},{"$error":"#NUM!"},47.441050008873276,1.0586472250070716E-15,1.0586472250070716E-15,87.340100442375913,4.8325300165839898E-15,-39.44444444444435,14.199999999999966,{"$error":"#NUM!"},0,0,0,-1.5620810564291831E-2,47.441050008873276,1.0586472250070716E-15,87.340100442375913,14.199999999999966,2.2697337499999709E-4]
[14.199999999999966,{"$error":"#NUM!"},{"$error":"#NUM!"},{"$error":"#NUM!"},3.7148658700887163,-3.7148658700887163,4.5512621809319574E-16,1.1706968128257578,{"$error":"#NUM!"},{"$error":"#NUM!"},{"$error":"#NUM!"},{"$error":"#NUM!"},47.441050008873276,1.0586472250070716E-15,1.0586472250070716E-15,87.340100442375913,4.8665619181092286E-15,-39.722222222222122,14.299999999999965,{"$error":"#NUM!"},0,0,0,-1.6385697543967456E-2,47.441050008873276,1.0586472250070716E-15,87.340100442375913,14.299999999999965,2.3596155555555254E-4]
[14.299999999999965,{"$error":"#NUM!"},{"$error":"#NUM!"},{"$error":"#NUM!"},3.7148658700887163,-3.7148658700887163,4.5512621809319574E-16,1.1706968128257578,{"$error":"#NUM!"},{"$error":"#NUM!"},{"$error":"#NUM!"},{"$error":"#NUM!"},47.441050008873276,1.0586472250070716E-15,1.0586472250070716E-15,87.340100442375913,4.9005938196344682E-15,-39.999999999999901,14.399999999999965,{"$error":"#NUM!"},0,0,0,-1.7173958005422204E-2,47.441050008873276,1.0586472250070716E-15,87.340100442375913,14.399999999999965,2.4512426388888573E-4]
[14.399999999999965,{"$error":"#NUM!"},{"$error":"#NUM!"},{"$error":"#NUM!"},3.7148658700887163,-3.7148658700887163,4.5512621809319574E-16,1.1706968128257578,{"$error":"#NUM!"},{"$error":"#NUM!"},{"$error":"#NUM!"},{"$error":"#NUM!"},47.441050008873276,1.0586472250070716E-15,1.0586472250070716E-15,87.340100442375913,4.934625721159707E-15,-40.277777777777679,14.499999999999964,{"$error":"#NUM!"},0,0,0,-1.798591657989658E-2,47.441050008873276,1.0586472250070716E-15,87.340100442375913,14.499999999999964,2.5446149999999674E-4]
[14.499999999999964,{"$error":"#NUM!"},{"$error":"#NUM!"},{"$error":"#NUM!"},3.7148658700887163,-3.7148658700887163,4.5512621809319574E-16,1.1706968128257578,{"$error":"#NUM!"},{"$error":"#NUM!"},{"$error":"#NUM!"},{"$error":"#NUM!"},47.441050008873276,1.0586472250070716E-15,1.0586472250070716E-15,87.340100442375913,4.9686576226849467E-15,-40.555555555555458,14.599999999999964,{"$error":"#NUM!"},0,0,0,-1.8821897898631094E-2,47.441050008873276,1.0586472250070716E-15,87.340100442375913,14.599999999999964,2.6397326388888571E-4]
[14.599999999999964,{"$error":"#NUM!"},{"$error":"#NUM!"},{"$error":"#NUM!"},3.7148658700887163,-3.7148658700887163,4.5512621809319574E-16,1.1706968128257578,{"$error":"#NUM!"},{"$error":"#NUM!"},{"$error":"#NUM!"},{"$error":"#NUM!"},47.441050008873276,1.0586472250070716E-15,1.0586472250070716E-15,87.340100442375913,5.0026895242101855E-15,-40.833333333333229,14.699999999999964,{"$error":"#NUM!"},0,0,0,-1.9682226592866215E-2,47.441050008873276,1.0586472250070716E-15,87.340100442375913,14.699999999999964,2.7365955555555229E-4]
[14.699999999999964,{"$error":"#NUM!"},{"$error":"#NUM!"},{"$error":"#NUM!"},3.7148658700887163,-3.7148658700887163,4.5512621809319574E-16,1.1706968128257578,{"$error":"#NUM!"},{"$error":"#NUM!"},{"$error":"#NUM!"},{"$error":"#NUM!"},47.441050008873276,1.0586472250070716E-15,1.0586472250070716E-15,87.340100442375913,5.0367214257354251E-15,-41.111111111111008,14.799999999999963,{"$error":"#NUM!"},0,0,0,-2.0567227293842465E-2,47.441050008873276,1.0586472250070716E-15,87.340100442375913,14.799999999999963,2.835203749999966E-4]
[14.799999999999963,{"$error":"#NUM!"},{"$error":"#NUM!"},{"$error":"#NUM!"},3.7148658700887163,-3.7148658700887163,4.5512621809319574E-16,1.1706968128257578,{"$error":"#NUM!"},{"$error":"#NUM!"},{"$error":"#NUM!"},{"$error":"#NUM!"},47.441050008873276,1.0586472250070716E-15,1.0586472250070716E-15,87.340100442375913,5.0707533272606647E-15,-41.388888888888786,14.899999999999963,{"$error":"#NUM!"},0,0,0,-2.1477224632800329E-2,47.441050008873276,1.0586472250070716E-15,87.340100442375913,14.899999999999963,2.9355572222221869E-4]
[14.899999999999963,{"$error":"#NUM!"},{"$error":"#NUM!"},{"$error":"#NUM!"},3.7148658700887163,-3.7148658700887163,4.5512621809319574E-16,1.1706968128257578,{"$error":"#NUM!"},{"$error":"#NUM!"},{"$error":"#NUM!"},{"$error":"#NUM!"},47.441050008873276,1.0586472250070716E-15,1.0586472250070716E-15,87.340100442375913,5.1047852287859044E-15,-41.666666666666565,14.999999999999963,{"$error":"#NUM!"},0,0,0,-2.2412543240980323E-2,47.441050008873276,1.0586472250070716E-15,87.340100442375913,14.999999999999963,3.0376559722221857E-4]
[14.999999999999963,{"$error":"#NUM!"},{"$error":"#NUM!"},{"$error":"#NUM!"},3.7148658700887163,-3.7148658700887163,4.5512621809319574E-16,1.1706968128257578,{"$error":"#NUM!"},{"$error":"#NUM!"},{"$error":"#NUM!"},{"$error":"#NUM!"},47.441050008873276,1.0586472250070716E-15,1.0586472250070716E-15,87.340100442375913,5.1388171303111432E-15,-41.944444444444336,15.099999999999962,{"$error":"#NUM!"},0,0,0,-2.3373507749622935E-2,47.441050008873276,1.0586472250070716E-15,87.340100442375913,15.099999999999962,3.1414999999999622E-4]
[15.099999999999962,{"$error":"#NUM!"},{"$error":"#NUM!"},{"$error":"#NUM!"},3.7148658700887163,-3.7148658700887163,4.5512621809319574E-16,1.1706968128257578,{"$error":"#NUM!"},{"$error":"#NUM!"},{"$error":"#NUM!"},{"$error":"#NUM!"},47.441050008873276,1.0586472250070716E-15,1.0586472250070716E-15,87.340100442375913,5.1728490318363828E-15,-42.222222222222115,15.199999999999962,{"$error":"#NUM!"},0,0,0,-2.4360442789968677E-2,47.441050008873276,1.0586472250070716E-15,87.340100442375913,15.199999999999962,3.2470893055555161E-4]
[15.199999999999962,{"$error":"#NUM!"},{"$error":"#NUM!"},{"$error":"#NUM!"},3.7148658700887163,-3.7148658700887163,4.5512621809319574E-16,1.1706968128257578,{"$error":"#NUM!"},{"$error":"#NUM!"},{"$error":"#NUM!"},{"$error":"#NUM!"},47.441050008873276,1.0586472250070716E-15,1.0586472250070716E-15,87.340100442375913,5.2068809333616216E-15,-42.499999999999893,15.299999999999962,{"$error":"#NUM!"},0,0,0,-2.5373672993258042E-2,47.441050008873276,1.0586472250070716E-15,87.340100442375913,15.299999999999962,3.3544238888888483E-4]
[15.299999999999962,{"$error":"#NUM!"},{"$error":"#NUM!"},{"$error":"#NUM!"},3.7148658700887163,-3.7148658700887163,4.5512621809319574E-16,1.1706968128257578,{"$error":"#NUM!"},{"$error":"#NUM!"},{"$error":"#NUM!"},{"$error":"#NUM!"},47.441050008873276,1.0586472250070716E-15,1.0586472250070716E-15,87.340100442375913,5.2409128348868613E-15,-42.777777777777672,15.399999999999961,{"$error":"#NUM!"},0,0,0,-2.6413522990731547E-2,47.441050008873276,1.0586472250070716E-15,87.340100442375913,15.399999999999961,3.4635037499999605E-4]
[15.399999999999961,{"$error":"#NUM!"},{"$error":"#NUM!"},{"$error":"#NUM!"},3.7148658700887163,-3.7148658700887163,4.5512621809319574E-16,1.1706968128257578,{"$error":"#NUM!"},{"$error":"#NUM!"},{"$error":"#NUM!"},{"$error":"#NUM!"},47.441050008873276,1.0586472250070716E-15,1.0586472250070716E-15,87.340100442375913,5.2749447364121001E-15,-43.055555555555443,15.499999999999961,{"$error":"#NUM!"},0,0,0,-2.7480317413629659E-2,47.441050008873276,1.0586472250070716E-15,87.340100442375913,15.499999999999961,3.5743288888888484E-4]
[15.499999999999961,{"$error":"#NUM!"},{"$error":"#NUM!"},{"$error":"#NUM!"},3.7148658700887163,-3.7148658700887163,4.5512621809319574E-16,1.1706968128257578,{"$error":"#NUM!"},{"$error":"#NUM!"},{"$error":"#NUM!"},{"$error":"#NUM!"},47.441050008873276,1.0586472250070716E-15,1.0586472250070716E-15,87.340100442375913,5.3089766379373397E-15,-43.333333333333222,15.599999999999961,{"$error":"#NUM!"},0,0,0,-2.8574380893192895E-2,47.441050008873276,1.0586472250070716E-15,87.340100442375913,15.599999999999961,3.6868993055555135E-4]
[15.599999999999961,{"$error":"#NUM!"},{"$error":"#NUM!"},{"$error":"#NUM!"},3.7148658700887163,-3.7148658700887163,4.5512621809319574E-16,1.1706968128257578,{"$error":"#NUM!"},{"$error":"#NUM!"},{"$error":"#NUM!"},{"$error":"#NUM!"},47.441050008873276,1.0586472250070716E-15,1.0586472250070716E-15,87.340100442375913,5.3430085394625793E-15,-43.611111111111001,15.69999999999996,{"$error":"#NUM!"},0,0,0,-2.9696038060661758E-2,47.441050008873276,1.0586472250070716E-15,87.340100442375913,15.69999999999996,3.801214999999957E-4]
[15.69999999999996,{"$error":"#NUM!"},{"$error":"#NUM!"},{"$error":"#NUM!"},3.7148658700887163,-3.7148658700887163,4.5512621809319574E-16,1.1706968128257578,{"$error":"#NUM!"},{"$error":"#NUM!"},{"$error":"#NUM!"},{"$error":"#NUM!"},47.441050008873276,1.0586472250070716E-15,1.0586472250070716E-15,87.340100442375913,5.3770404409878189E-15,-43.888888888888779,15.79999999999996,{"$error":"#NUM!"},0,0,0,-3.0845613547276735E-2,47.441050008873276,1.0586472250070716E-15,87.340100442375913,15.79999999999996,3.9172759722221772E-4]
[15.79999999999996,{"$error":"#NUM!"},{"$error":"#NUM!"},{"$error":"#NUM!"},3.7148658700887163,-3.7148658700887163,4.5512621809319574E-16,1.1706968128257578,{"$error":"#NUM!"},{"$error":"#NUM!"},{"$error":"#NUM!"},{"$error":"#NUM!"},47.441050008873276,1.0586472250070716E-15,1.0586472250070716E-15,87.340100442375913,5.4110723425130578E-15,-44.166666666666551,15.899999999999959,{"$error":"#NUM!"},0,0,0,-3.2023431984278337E-2,47.441050008873276,1.0586472250070716E-15,87.340100442375913,15.899999999999959,4.0350822222221758E-4]
[15.899999999999959,{"$error":"#NUM!"},{"$error":"#NUM!"},{"$error":"#NUM!"},3.7148658700887163,-3.7148658700887163,4.5512621809319574E-16,1.1706968128257578,{"$error":"#NUM!"},{"$error":"#NUM!"},{"$error":"#NUM!"},{"$error":"#NUM!"},47.441050008873276,1.0586472250070716E-15,1.0586472250070716E-15,87.340100442375913,5.4451042440382974E-15,-44.444444444444329,15.999999999999959,{"$error":"#NUM!"},0,0,0,{"$f":"IF($B$24=\"C\",IF((3.14159265*1860/4)*((0.001*$B$18)-(2*$B$26*A190))^2*((0.33333*0.001*$B$18)-(2*$B$26*A190))<0,(3.14159265*1860/4)*((0.001*$B$18)-(2*$B$26*A190))^2*((0.33333*0.001*$B$18)-(2*$B$26*A190)),(3.14159265*1860/4)*((0.001*$B$18)-(2*$B$26*A190))^2*((0.33333*0.001*$B$18)-(2*$B$26*A190))),$B$19)","v":-3.3229818002907065E-2},47.441050008873276,1.0586472250070716E-15,87.340100442375913,15.999999999999959,4.1546337499999522E-4]
[15.999999999999959,{"$error":"#NUM!"},{"$error":"#NUM!"},{"$error":"#NUM!"},3.7148658700887163,-3.7148658700887163,4.5512621809319574E-16,1.1706968128257578,{"$error":"#NUM!"},{"$error":"#NUM!"},{"$error":"#NUM!"},{"$error":"#NUM!"},47.441050008873276,1.0586472250070716E-15,1.0586472250070716E-15,87.340100442375913,5.4791361455635362E-15,-44.722222222222108,16.099999999999959,{"$error":"#NUM!"},0,0,0,-3.4465096234403428E-2,47.441050008873276,1.0586472250070716E-15,87.340100442375913,16.099999999999959,4.275930555555507E-4]
[16.099999999999959,{"$error":"#NUM!"},{"$error":"#NUM!"},{"$error":"#NUM!"},3.7148658700887163,-3.7148658700887163,4.5512621809319574E-16,1.1706968128257578,{"$error":"#NUM!"},{"$error":"#NUM!"},{"$error":"#NUM!"},{"$error":"#NUM!"},47.441050008873276,1.0586472250070716E-15,1.0586472250070716E-15,87.340100442375913,5.5131680470887758E-15,-44.999999999999886,16.19999999999996,{"$error":"#NUM!"},0,0,0,-3.5729591310007899E-2,47.441050008873276,1.0586472250070716E-15,87.340100442375913,16.19999999999996,4.3989726388888386E-4]
[16.19999999999996,{"$error":"#NUM!"},{"$error":"#NUM!"},{"$error":"#NUM!"},3.7148658700887163,-3.7148658700887163,4.5512621809319574E-16,1.1706968128257578,{"$error":"#NUM!"},{"$error":"#NUM!"},{"$error":"#NUM!"},{"$error":"#NUM!"},47.441050008873276,1.0586472250070716E-15,1.0586472250070716E-15,87.340100442375913,5.5471999486140163E-15,-45.277777777777672,16.299999999999962,{"$error":"#NUM!"},0,0,0,-3.7023627860961028E-2,47.441050008873276,1.0586472250070716E-15,87.340100442375913,16.299999999999962,4.5237599999999511E-4]
[16.299999999999962,{"$error":"#NUM!"},{"$error":"#NUM!"},{"$error":"#NUM!"},3.7148658700887163,-3.7148658700887163,4.5512621809319574E-16,1.1706968128257578,{"$error":"#NUM!"},{"$error":"#NUM!"},{"$error":"#NUM!"},{"$error":"#NUM!"},47.441050008873276,1.0586472250070716E-15,1.0586472250070716E-15,87.340100442375913,5.5812318501392559E-15,-45.555555555555451,16.399999999999963,{"$error":"#NUM!"},0,0,0,-3.834753051850328E-2,47.441050008873276,1.0586472250070716E-15,87.340100442375913,16.399999999999963,4.650292638888841E-4]
[16.399999999999963,{"$error":"#NUM!"},{"$error":"#NUM!"},{"$error":"#NUM!"},3.7148658700887163,-3.7148658700887163,4.5512621809319574E-16,1.1706968128257578,{"$error":"#NUM!"},{"$error":"#NUM!"},{"$error":"#NUM!"},{"$error":"#NUM!"},47.441050008873276,1.0586472250070716E-15,1.0586472250070716E-15,87.340100442375913,5.6152637516644963E-15,-45.833333333333236,16.499999999999964,{"$error":"#NUM!"},0,0,0,-3.9701623913875154E-2,47.441050008873276,1.0586472250070716E-15,87.340100442375913,16.499999999999964,4.7785705555555087E-4]
[16.499999999999964,{"$error":"#NUM!"},{"$error":"#NUM!"},{"$error":"#NUM!"},3.7148658700887163,-3.7148658700887163,4.5512621809319574E-16,1.1706968128257578,{"$error":"#NUM!"},{"$error":"#NUM!"},{"$error":"#NUM!"},{"$error":"#NUM!"},47.441050008873276,1.0586472250070716E-15,1.0586472250070716E-15,87.340100442375913,5.6492956531897359E-15,-46.111111111111015,16.599999999999966,{"$error":"#NUM!"},0,0,0,-4.1086232678317153E-2,47.441050008873276,1.0586472250070716E-15,87.340100442375913,16.599999999999966,4.9085937499999542E-4]
[16.599999999999966,{"$error":"#NUM!"},{"$error":"#NUM!"},{"$error":"#NUM!"},3.7148658700887163,-3.7148658700887163,4.5512621809319574E-16,1.1706968128257578,{"$error":"#NUM!"},{"$error":"#NUM!"},{"$error":"#NUM!"},{"$error":"#NUM!"},47.441050008873276,1.0586472250070716E-15,1.0586472250070716E-15,87.340100442375913,5.6833275547149755E-15,-46.388888888888793,16.699999999999967,{"$error":"#NUM!"},0,0,0,-4.2501681443069782E-2,47.441050008873276,1.0586472250070716E-15,87.340100442375913,16.699999999999967,5.0403622222221786E-4]
[16.699999999999967,{"$error":"#NUM!"},{"$error":"#NUM!"},{"$error":"#NUM!"},3.7148658700887163,-3.7148658700887163,4.5512621809319574E-16,1.1706968128257578,{"$error":"#NUM!"},{"$error":"#NUM!"},{"$error":"#NUM!"},{"$error":"#NUM!"},47.441050008873276,1.0586472250070716E-15,1.0586472250070716E-15,87.340100442375913,5.7173594562402159E-15,-46.666666666666579,16.799999999999969,{"$error":"#NUM!"},0,0,0,-4.3948294839373535E-2,47.441050008873276,1.0586472250070716E-15,87.340100442375913,16.799999999999969,5.1738759722221798E-4]
[16.799999999999969,{"$error":"#NUM!"},{"$error":"#NUM!"},{"$error":"#NUM!"},3.7148658700887163,-3.7148658700887163,4.5512621809319574E-16,1.1706968128257578,{"$error":"#NUM!"},{"$error":"#NUM!"},{"$error":"#NUM!"},{"$error":"#NUM!"},47.441050008873276,1.0586472250070716E-15,1.0586472250070716E-15,87.340100442375913,5.7513913577654556E-15,-46.944444444444358,16.89999999999997,{"$error":"#NUM!"},0,0,0,-4.5426397498468912E-2,47.441050008873276,1.0586472250070716E-15,87.340100442375913,16.89999999999997,5.3091349999999588E-4]
[16.89999999999997,{"$error":"#NUM!"},{"$error":"#NUM!"},{"$error":"#NUM!"},3.7148658700887163,-3.7148658700887163,4.5512621809319574E-16,1.1706968128257578,{"$error":"#NUM!"},{"$error":"#NUM!"},{"$error":"#NUM!"},{"$error":"#NUM!"},47.441050008873276,1.0586472250070716E-15,1.0586472250070716E-15,87.340100442375913,5.785423259290696E-15,-47.222222222222143,16.999999999999972,{"$error":"#NUM!"},0,0,0,-4.6936314051596408E-2,47.441050008873276,1.0586472250070716E-15,87.340100442375913,16.999999999999972,5.4461393055555156E-4]
[16.999999999999972,{"$error":"#NUM!"},{"$error":"#NUM!"},{"$error":"#NUM!"},3.7148658700887163,-3.7148658700887163,4.5512621809319574E-16,1.1706968128257578,{"$error":"#NUM!"},{"$error":"#NUM!"},{"$error":"#NUM!"},{"$error":"#NUM!"},47.441050008873276,1.0586472250070716E-15,1.0586472250070716E-15,87.340100442375913,5.8194551608159356E-15,-47.499999999999922,17.099999999999973,{"$error":"#NUM!"},0,0,0,-4.8478369129996535E-2,47.441050008873276,1.0586472250070716E-15,87.340100442375913,17.099999999999973,5.5848888888888502E-4]
[17.099999999999973,{"$error":"#NUM!"},{"$error":"#NUM!"},{"$error":"#NUM!"},3.7148658700887163,-3.7148658700887163,4.5512621809319574E-16,1.1706968128257578,{"$error":"#NUM!"},{"$error":"#NUM!"},{"$error":"#NUM!"},{"$error":"#NUM!"},47.441050008873276,1.0586472250070716E-15,1.0586472250070716E-15,87.340100442375913,5.853487062341176E-15,-47.777777777777708,17.199999999999974,{"$error":"#NUM!"},0,0,0,-5.005288736490978E-2,47.441050008873276,1.0586472250070716E-15,87.340100442375913,17.199999999999974,5.7253837499999637E-4]
[17.199999999999974,{"$error":"#NUM!"},{"$error":"#NUM!"},{"$error":"#NUM!"},3.7148658700887163,-3.7148658700887163,4.5512621809319574E-16,1.1706968128257578,{"$error":"#NUM!"},{"$error":"#NUM!"},{"$error":"#NUM!"},{"$error":"#NUM!"},47.441050008873276,1.0586472250070716E-15,1.0586472250070716E-15,87.340100442375913,5.8875189638664156E-15,-48.055555555555486,17.299999999999976,{"$error":"#NUM!"},0,0,0,-5.1660193387576651E-2,47.441050008873276,1.0586472250070716E-15,87.340100442375913,17.299999999999976,5.867623888888854E-4]
[17.299999999999976,{"$error":"#NUM!"},{"$error":"#NUM!"},{"$error":"#NUM!"},3.7148658700887163,-3.7148658700887163,4.5512621809319574E-16,1.1706968128257578,{"$error":"#NUM!"},{"$error":"#NUM!"},{"$error":"#NUM!"},{"$error":"#NUM!"},47.441050008873276,1.0586472250070716E-15,1.0586472250070716E-15,87.340100442375913,5.921550865391656E-15,-48.333333333333272,17.399999999999977,{"$error":"#NUM!"},0,0,0,-5.3300611829237655E-2,47.441050008873276,1.0586472250070716E-15,87.340100442375913,17.399999999999977,6.0116093055555221E-4]
[17.399999999999977,{"$error":"#NUM!"},{"$error":"#NUM!"},{"$error":"#NUM!"},3.7148658700887163,-3.7148658700887163,4.5512621809319574E-16,1.1706968128257578,{"$error":"#NUM!"},{"$error":"#NUM!"},{"$error":"#NUM!"},{"$error":"#NUM!"},47.441050008873276,1.0586472250070716E-15,1.0586472250070716E-15,87.340100442375913,5.9555827669168956E-15,-48.61111111111105,17.499999999999979,{"$error":"#NUM!"},0,0,0,-5.4974467321133286E-2,47.441050008873276,1.0586472250070716E-15,87.340100442375913,17.499999999999979,6.1573399999999691E-4]
[17.499999999999979,{"$error":"#NUM!"},{"$error":"#NUM!"},{"$error":"#NUM!"},3.7148658700887163,-3.7148658700887163,4.5512621809319574E-16,1.1706968128257578,{"$error":"#NUM!"},{"$error":"#NUM!"},{"$error":"#NUM!"},{"$error":"#NUM!"},47.441050008873276,1.0586472250070716E-15,1.0586472250070716E-15,87.340100442375913,5.9896146684421353E-15,-48.888888888888829,17.59999999999998,{"$error":"#NUM!"},0,0,0,-5.6682084494504036E-2,47.441050008873276,1.0586472250070716E-15,87.340100442375913,17.59999999999998,6.3048159722221928E-4]
[17.59999999999998,{"$error":"#NUM!"},{"$error":"#NUM!"},{"$error":"#NUM!"},3.7148658700887163,-3.7148658700887163,4.5512621809319574E-16,1.1706968128257578,{"$error":"#NUM!"},{"$error":"#NUM!"},{"$error":"#NUM!"},{"$error":"#NUM!"},47.441050008873276,1.0586472250070716E-15,1.0586472250070716E-15,87.340100442375913,6.0236465699673757E-15,-49.166666666666615,17.699999999999982,{"$error":"#NUM!"},0,0,0,-5.8423787980590419E-2,47.441050008873276,1.0586472250070716E-15,87.340100442375913,17.699999999999982,6.4540372222221943E-4]
[17.699999999999982,{"$error":"#NUM!"},{"$error":"#NUM!"},{"$error":"#NUM!"},3.7148658700887163,-3.7148658700887163,4.5512621809319574E-16,1.1706968128257578,{"$error":"#NUM!"},{"$error":"#NUM!"},{"$error":"#NUM!"},{"$error":"#NUM!"},47.441050008873276,1.0586472250070716E-15,1.0586472250070716E-15,87.340100442375913,6.0576784714926145E-15,-49.444444444444393,17.799999999999983,{"$error":"#NUM!"},0,0,0,-6.0199902410632916E-2,47.441050008873276,1.0586472250070716E-15,87.340100442375913,17.799999999999983,6.6050037499999748E-4]
[17.799999999999983,{"$error":"#NUM!"},{"$error":"#NUM!"},{"$error":"#NUM!"},3.7148658700887163,-3.7148658700887163,4.5512621809319574E-16,1.1706968128257578,{"$error":"#NUM!"},{"$error":"#NUM!"},{"$error":"#NUM!"},{"$error":"#NUM!"},47.441050008873276,1.0586472250070716E-15,1.0586472250070716E-15,87.340100442375913,6.0917103730178549E-15,-49.722222222222179,17.899999999999984,{"$error":"#NUM!"},0,0,0,-6.2010752415872041E-2,47.441050008873276,1.0586472250070716E-15,87.340100442375913,17.899999999999984,6.757715555555532E-4]
[17.899999999999984,{"$error":"#NUM!"},{"$error":"#NUM!"},{"$error":"#NUM!"},3.7148658700887163,-3.7148658700887163,4.5512621809319574E-16,1.1706968128257578,{"$error":"#NUM!"},{"$error":"#NUM!"},{"$error":"#NUM!"},{"$error":"#NUM!"},47.441050008873276,1.0586472250070716E-15,1.0586472250070716E-15,87.340100442375913,6.1257422745430945E-15,-49.999999999999957,17.999999999999986,{"$error":"#NUM!"},0,0,0,-6.3856662627548286E-2,47.441050008873276,1.0586472250070716E-15,87.340100442375913,17.999999999999986,6.912172638888867E-4]
[17.999999999999986,{"$error":"#NUM!"},{"$error":"#NUM!"},{"$error":"#NUM!"},3.7148658700887163,-3.7148658700887163,4.5512621809319574E-16,1.1706968128257578,{"$error":"#NUM!"},{"$error":"#NUM!"},{"$error":"#NUM!"},{"$error":"#NUM!"},47.441050008873276,1.0586472250070716E-15,1.0586472250070716E-15,87.340100442375913,6.1597741760683349E-15,-50.277777777777743,18.099999999999987,{"$error":"#NUM!"},0,0,0,-6.5737957676902173E-2,47.441050008873276,1.0586472250070716E-15,87.340100442375913,18.099999999999987,7.0683749999999809E-4]
[18.099999999999987,{"$error":"#NUM!"},{"$error":"#NUM!"},{"$error":"#NUM!"},3.7148658700887163,-3.7148658700887163,4.5512621809319574E-16,1.1706968128257578,{"$error":"#NUM!"},{"$error":"#NUM!"},{"$error":"#NUM!"},{"$error":"#NUM!"},47.441050008873276,1.0586472250070716E-15,1.0586472250070716E-15,87.340100442375913,6.1938060775935746E-15,-50.555555555555522,18.199999999999989,{"$error":"#NUM!"},0,0,0,-6.7654962195174168E-2,47.441050008873276,1.0586472250070716E-15,87.340100442375913,18.199999999999989,7.2263226388888716E-4]
[18.199999999999989,{"$error":"#NUM!"},{"$error":"#NUM!"},{"$error":"#NUM!"},3.7148658700887163,-3.7148658700887163,4.5512621809319574E-16,1.1706968128257578,{"$error":"#NUM!"},{"$error":"#NUM!"},{"$error":"#NUM!"},{"$error":"#NUM!"},47.441050008873276,1.0586472250070716E-15,1.0586472250070716E-15,87.340100442375913,6.227837979118815E-15,-50.833333333333307,18.29999999999999,{"$error":"#NUM!"},0,0,0,-6.9608000813604784E-2,47.441050008873276,1.0586472250070716E-15,87.340100442375913,18.29999999999999,7.3860155555555401E-4]
[18.29999999999999,{"$error":"#NUM!"},{"$error":"#NUM!"},{"$error":"#NUM!"},3.7148658700887163,-3.7148658700887163,4.5512621809319574E-16,1.1706968128257578,{"$error":"#NUM!"},{"$error":"#NUM!"},{"$error":"#NUM!"},{"$error":"#NUM!"},47.441050008873276,1.0586472250070716E-15,1.0586472250070716E-15,87.340100442375913,6.2618698806440546E-15,-51.111111111111086,18.399999999999991,{"$error":"#NUM!"},0,0,0,-7.159739816343455E-2,47.441050008873276,1.0586472250070716E-15,87.340100442375913,18.399999999999991,7.5474537499999874E-4]
[18.399999999999991,{"$error":"#NUM!"},{"$error":"#NUM!"},{"$error":"#NUM!"},3.7148658700887163,-3.7148658700887163,4.5512621809319574E-16,1.1706968128257578,{"$error":"#NUM!"},{"$error":"#NUM!"},{"$error":"#NUM!"},{"$error":"#NUM!"},47.441050008873276,1.0586472250070716E-15,1.0586472250070716E-15,87.340100442375913,6.2959017821692942E-15,-51.388888888888864,18.499999999999993,{"$error":"#NUM!"},0,0,0,-7.3623478875903911E-2,47.441050008873276,1.0586472250070716E-15,87.340100442375913,18.499999999999993,7.7106372222222116E-4]
[18.499999999999993,{"$error":"#NUM!"},{"$error":"#NUM!"},{"$error":"#NUM!"},3.7148658700887163,-3.7148658700887163,4.5512621809319574E-16,1.1706968128257578,{"$error":"#NUM!"},{"$error":"#NUM!"},{"$error":"#NUM!"},{"$error":"#NUM!"},47.441050008873276,1.0586472250070716E-15,1.0586472250070716E-15,87.340100442375913,6.3299336836945346E-15,-51.66666666666665,18.599999999999994,{"$error":"#NUM!"},0,0,0,-7.5686567582253422E-2,47.441050008873276,1.0586472250070716E-15,87.340100442375913,18.599999999999994,7.8755659722222146E-4]
[18.599999999999994,{"$error":"#NUM!"},{"$error":"#NUM!"},{"$error":"#NUM!"},3.7148658700887163,-3.7148658700887163,4.5512621809319574E-16,1.1706968128257578,{"$error":"#NUM!"},{"$error":"#NUM!"},{"$error":"#NUM!"},{"$error":"#NUM!"},47.441050008873276,1.0586472250070716E-15,1.0586472250070716E-15,87.340100442375913,6.3639655852197742E-15,-51.944444444444429,18.699999999999996,{"$error":"#NUM!"},0,0,0,-7.7786988913723543E-2,47.441050008873276,1.0586472250070716E-15,87.340100442375913,18.699999999999996,8.0422399999999933E-4]
[18.699999999999996,{"$error":"#NUM!"},{"$error":"#NUM!"},{"$error":"#NUM!"},3.7148658700887163,-3.7148658700887163,4.5512621809319574E-16,1.1706968128257578,{"$error":"#NUM!"},{"$error":"#NUM!"},{"$error":"#NUM!"},{"$error":"#NUM!"},47.441050008873276,1.0586472250070716E-15,1.0586472250070716E-15,87.340100442375913,6.3979974867450146E-15,-52.222222222222214,18.799999999999997,{"$error":"#NUM!"},0,0,0,-7.99250675015548E-2,47.441050008873276,1.0586472250070716E-15,87.340100442375913,18.799999999999997,8.2106593055555519E-4]
[18.799999999999997,{"$error":"#NUM!"},{"$error":"#NUM!"},{"$error":"#NUM!"},3.7148658700887163,-3.7148658700887163,4.5512621809319574E-16,1.1706968128257578,{"$error":"#NUM!"},{"$error":"#NUM!"},{"$error":"#NUM!"},{"$error":"#NUM!"},47.441050008873276,1.0586472250070716E-15,1.0586472250070716E-15,87.340100442375913,6.4320293882702543E-15,-52.499999999999993,18.899999999999999,{"$error":"#NUM!"},0,0,0,-8.2101127976987667E-2,47.441050008873276,1.0586472250070716E-15,{"$f":"IF(X219<=0,P219,0)","v":87.340100442375913},18.899999999999999,8.3808238888888873E-4]
[18.899999999999999,{"$error":"#NUM!"},{"$error":"#NUM!"},{"$error":"#NUM!"},3.7148658700887163,-3.7148658700887163,4.5512621809319574E-16,1.1706968128257578,{"$error":"#NUM!"},{"$error":"#NUM!"},{"$error":"#NUM!"},{"$error":"#NUM!"},47.441050008873276,1.0586472250070716E-15,1.0586472250070716E-15,87.340100442375913,6.4660612897954947E-15,-52.777777777777779,19,{"$error":"#NUM!"},0,0,0,-8.4315494971262672E-2,47.441050008873276,1.0586472250070716E-15,87.340100442375913,19,8.5527337500000016E-4]
[19,{"$error":"#NUM!"},{"$error":"#NUM!"},{"$error":"#NUM!"},3.7148658700887163,-3.7148658700887163,4.5512621809319574E-16,1.1706968128257578,{"$error":"#NUM!"},{"$error":"#NUM!"},{"$error":"#NUM!"},{"$error":"#NUM!"},47.441050008873276,1.0586472250070716E-15,1.0586472250070716E-15,87.340100442375913,6.5000931913207343E-15,-53.055555555555557,19.100000000000001,{"$error":"#NUM!"},0,0,0,-8.6568493115620301E-2,47.441050008873276,1.0586472250070716E-15,87.340100442375913,19.100000000000001,8.7263888888888927E-4]
[19.100000000000001,{"$error":"#NUM!"},{"$error":"#NUM!"},{"$error":"#NUM!"},3.7148658700887163,-3.7148658700887163,4.5512621809319574E-16,1.1706968128257578,{"$error":"#NUM!"},{"$error":"#NUM!"},{"$error":"#NUM!"},{"$error":"#NUM!"},47.441050008873276,1.0586472250070716E-15,1.0586472250070716E-15,87.340100442375913,6.5341250928459747E-15,-53.333333333333343,19.200000000000003,{"$error":"#NUM!"},0,0,0,-8.8860447041301041E-2,47.441050008873276,1.0586472250070716E-15,87.340100442375913,19.200000000000003,8.9017893055555616E-4]
[19.200000000000003,{"$error":"#NUM!"},{"$error":"#NUM!"},{"$error":"#NUM!"},3.7148658700887163,-3.7148658700887163,4.5512621809319574E-16,1.1706968128257578,{"$f":"SQRT(((B223-F223)^2)+((C223-G223)^2)+(D223^2))","v":{"$error":"#NUM!"}},{"$error":"#NUM!"},{"$error":"#NUM!"},{"$error":"#NUM!"},47.441050008873276,1.0586472250070716E-15,{"$f":"ABS(N223)","v":1.0586472250070716E-15},87.340100442375913,6.5681569943712143E-15,-53.611111111111121,19.300000000000004,{"$error":"#NUM!"},0,0,0,-9.1191681379545447E-2,47.441050008873276,1.0586472250070716E-15,87.340100442375913,19.300000000000004,9.0789350000000104E-4]
[{"$f":"A223+$B$22","v":19.300000000000004},{"$f":"B223+(J223*$B$22)","v":{"$error":"#NUM!"}},{"$f":"C223+(K223*$B$22)","v":{"$error":"#NUM!"}},{"$f":"D223+(L223*$B$22)","v":{"$error":"#NUM!"}},{"$f":"IF($B$13=2,$B$23*((0.1036*LN(ABS(P223+1)))+0.8731),IF($B$13=3,$B$23*((0.139*LN(ABS(P223+1)))+0.7503),$B$23))","v":3.7148658700887163},{"$f":"E224*COS(RADIANS($B$10))","v":-3.7148658700887163},{"$f":"E224*SIN(RADIANS($B$10))","v":4.5512621809319574E-16},{"$f":"1.22*EXP(-0.0001065*(P223+$B$12))","v":1.1706968128257578},{"$error":"#NUM!"},{"$error":"#NUM!"},{"$error":"#NUM!"},{"$error":"#NUM!"},{"$f":"IF(X224>0,IF(P223<=Param_1,M223,M223+(B225*$B$22)),M223)","v":47.441050008873276},{"$f":"IF(X224>0,IF(P223<=Param_1,N223,N223+(C225*$B$22)),N223)","v":1.0586472250070716E-15},1.0586472250070716E-15,{"$f":"IF(X224>0,IF(P223<Param_1,P223,P223+(D225*$B$22)),P223)","v":87.340100442375913},{"$f":"IF(P223<Param_1,Q223,A225*$B$23*SIN(RADIANS($B$10)))","v":6.6021888958964539E-15},{"$f":"IF(P223<Param_1,R223,A225*$B$23*COS(RADIANS($B$10)))","v":-53.8888888888889},{"$f":"IF(P223<Param_1,S223,A225)","v":19.400000000000006},{"$error":"#NUM!"},0,0,0,-9.3562520761593937E-2,{"$f":"IF(X224<=0,M224,0)","v":47.441050008873276},{"$f":"IF(X224<=0,N224,0)","v":1.0586472250070716E-15},87.340100442375913,{"$f":"IF(X224<=0,S224,3000)","v":19.400000000000006},{"$f":"IF($B$24=\"S\",$B$20,3.1415*(($B$18*0.0005)-($B$26*A224))^2)","v":9.2578259722222338E-4}]
[19.400000000000006,{"$error":"#NUM!"},{"$error":"#NUM!"},{"$error":"#NUM!"},3.7148658700887163,-3.7148658700887163,4.5512621809319574E-16,1.1706968128257578,{"$error":"#NUM!"},{"$f":"-0.5*H225*I225*AC225*$B$17*(B225-F225)/X225","v":{"$error":"#NUM!"}},{"$f":"-0.5*H225*I225*AC225*$B$17*(C225-G225)/X225","v":{"$error":"#NUM!"}},{"$f":"(-0.5*H225*AC225*I225*$B$17*D225/X225)-$B$21","v":{"$error":"#NUM!"}},47.441050008873276,1.0586472250070716E-15,1.0586472250070716E-15,87.340100442375913,6.6362207974216944E-15,-54.166666666666686,19.500000000000007,{"$f":"IF(D225<0,T224,A226)","v":{"$error":"#NUM!"}},{"$f":"IF(ROUND(A225*10,3)=$B$14*10,M225,0)","v":0},{"$f":"IF(ROUND(A225*10,3)=$B$14*10,N225,0)","v":0},{"$f":"IF(ROUND(A225*10,3)=$B$14*10,P225,0)","v":0},-9.5973289818687066E-2,47.441050008873276,1.0586472250070716E-15,87.340100442375913,19.500000000000007,9.4384622222222383E-4]
[19.500000000000007,{"$error":"#NUM!"},{"$error":"#NUM!"},{"$error":"#NUM!"},3.7148658700887163,-3.7148658700887163,4.5512621809319574E-16,1.1706968128257578,{"$error":"#NUM!"},{"$error":"#NUM!"},{"$error":"#NUM!"},{"$error":"#NUM!"},47.441050008873276,1.0586472250070716E-15,1.0586472250070716E-15,87.340100442375913,6.670252698946934E-15,-54.444444444444464,19.600000000000009,{"$error":"#NUM!"},0,0,0,-9.8424313182065307E-2,47.441050008873276,1.0586472250070716E-15,87.340100442375913,19.600000000000009,9.6208437500000174E-4]
[19.600000000000009,{"$error":"#NUM!"},{"$error":"#NUM!"},{"$error":"#NUM!"},3.7148658700887163,-3.7148658700887163,4.5512621809319574E-16,1.1706968128257578,{"$error":"#NUM!"},{"$error":"#NUM!"},{"$error":"#NUM!"},{"$error":"#NUM!"},47.441050008873276,1.0586472250070716E-15,1.0586472250070716E-15,87.340100442375913,6.7042846004721744E-15,-54.72222222222225,19.70000000000001,{"$error":"#NUM!"},0,0,0,-0.10091591548296919,47.441050008873276,1.0586472250070716E-15,87.340100442375913,19.70000000000001,9.8049705555555765E-4]
[19.70000000000001,{"$error":"#NUM!"},{"$error":"#NUM!"},{"$error":"#NUM!"},3.7148658700887163,-3.7148658700887163,4.5512621809319574E-16,1.1706968128257578,{"$error":"#NUM!"},{"$error":"#NUM!"},{"$error":"#NUM!"},{"$error":"#NUM!"},47.441050008873276,1.0586472250070716E-15,1.0586472250070716E-15,87.340100442375913,6.7383165019974132E-15,-55.000000000000028,19.800000000000011,{"$error":"#NUM!"},0,0,0,-0.10344842135263919,47.441050008873276,1.0586472250070716E-15,87.340100442375913,19.800000000000011,9.9908426388889133E-4]
[19.800000000000011,{"$error":"#NUM!"},{"$error":"#NUM!"},{"$error":"#NUM!"},3.7148658700887163,-3.7148658700887163,4.5512621809319574E-16,1.1706968128257578,{"$error":"#NUM!"},{"$error":"#NUM!"},{"$error":"#NUM!"},{"$error":"#NUM!"},47.441050008873276,1.0586472250070716E-15,1.0586472250070716E-15,87.340100442375913,6.7723484035226536E-15,-55.277777777777814,19.900000000000013,{"$error":"#NUM!"},0,0,0,-0.10602215542231583,47.441050008873276,1.0586472250070716E-15,87.340100442375913,19.900000000000013,1.0178460000000026E-3]
[19.900000000000013,{"$error":"#NUM!"},{"$error":"#NUM!"},{"$error":"#NUM!"},3.7148658700887163,-3.7148658700887163,4.5512621809319574E-16,1.1706968128257578,{"$error":"#NUM!"},{"$error":"#NUM!"},{"$error":"#NUM!"},{"$error":"#NUM!"},47.441050008873276,1.0586472250070716E-15,1.0586472250070716E-15,87.340100442375913,6.8063803050478932E-15,-55.555555555555593,20.000000000000014,{"$error":"#NUM!"},0,0,0,-0.10863744232323957,47.441050008873276,1.0586472250070716E-15,87.340100442375913,20.000000000000014,1.0367822638888918E-3]
[20.000000000000014,{"$error":"#NUM!"},{"$error":"#NUM!"},{"$error":"#NUM!"},3.7148658700887163,-3.7148658700887163,4.5512621809319574E-16,1.1706968128257578,{"$error":"#NUM!"},{"$error":"#NUM!"},{"$error":"#NUM!"},{"$error":"#NUM!"},47.441050008873276,1.0586472250070716E-15,1.0586472250070716E-15,87.340100442375913,6.8404122065731329E-15,-55.833333333333371,20.100000000000016,{"$error":"#NUM!"},0,0,0,-0.11129460668665095,47.441050008873276,1.0586472250070716E-15,87.340100442375913,20.100000000000016,1.0558930555555587E-3]
[20.100000000000016,{"$error":"#NUM!"},{"$error":"#NUM!"},{"$error":"#NUM!"},3.7148658700887163,-3.7148658700887163,4.5512621809319574E-16,1.1706968128257578,{"$error":"#NUM!"},{"$error":"#NUM!"},{"$error":"#NUM!"},{"$error":"#NUM!"},47.441050008873276,1.0586472250070716E-15,1.0586472250070716E-15,87.340100442375913,6.8744441080983733E-15,-56.111111111111157,20.200000000000017,{"$error":"#NUM!"},0,0,0,-0.11399397314379048,47.441050008873276,1.0586472250070716E-15,87.340100442375913,20.200000000000017,1.0751783750000037E-3]
[20.200000000000017,{"$error":"#NUM!"},{"$error":"#NUM!"},{"$error":"#NUM!"},3.7148658700887163,-3.7148658700887163,4.5512621809319574E-16,1.1706968128257578,{"$error":"#NUM!"},{"$error":"#NUM!"},{"$error":"#NUM!"},{"$error":"#NUM!"},47.441050008873276,1.0586472250070716E-15,1.0586472250070716E-15,87.340100442375913,6.9084760096236129E-15,-56.388888888888935,20.300000000000018,{"$error":"#NUM!"},0,0,0,-0.11673586632589861,47.441050008873276,1.0586472250070716E-15,87.340100442375913,20.300000000000018,1.0946382222222261E-3]
[20.300000000000018,{"$error":"#NUM!"},{"$error":"#NUM!"},{"$error":"#NUM!"},3.7148658700887163,-3.7148658700887163,4.5512621809319574E-16,1.1706968128257578,{"$error":"#NUM!"},{"$error":"#NUM!"},{"$error":"#NUM!"},{"$error":"#NUM!"},47.441050008873276,1.0586472250070716E-15,1.0586472250070716E-15,87.340100442375913,6.9425079111488533E-15,-56.666666666666721,20.40000000000002,{"$error":"#NUM!"},0,0,0,-0.11952061086421585,47.441050008873276,1.0586472250070716E-15,87.340100442375913,20.40000000000002,1.1142725972222265E-3]
[20.40000000000002,{"$error":"#NUM!"},{"$error":"#NUM!"},{"$error":"#NUM!"},3.7148658700887163,-3.7148658700887163,4.5512621809319574E-16,1.1706968128257578,{"$error":"#NUM!"},{"$error":"#NUM!"},{"$error":"#NUM!"},{"$error":"#NUM!"},47.441050008873276,1.0586472250070716E-15,1.0586472250070716E-15,87.340100442375913,6.9765398126740929E-15,-56.9444444444445,20.500000000000021,{"$error":"#NUM!"},0,0,0,-0.12234853138998274,47.441050008873276,1.0586472250070716E-15,87.340100442375913,20.500000000000021,1.1340815000000046E-3]
[20.500000000000021,{"$error":"#NUM!"},{"$error":"#NUM!"},{"$error":"#NUM!"},3.7148658700887163,-3.7148658700887163,4.5512621809319574E-16,1.1706968128257578,{"$error":"#NUM!"},{"$error":"#NUM!"},{"$error":"#NUM!"},{"$error":"#NUM!"},47.441050008873276,1.0586472250070716E-15,1.0586472250070716E-15,87.340100442375913,7.0105717141993333E-15,-57.222222222222285,20.600000000000023,{"$error":"#NUM!"},0,0,0,-0.12521995253443971,47.441050008873276,1.0586472250070716E-15,87.340100442375913,20.600000000000023,1.1540649305555603E-3]
[20.600000000000023,{"$error":"#NUM!"},{"$error":"#NUM!"},{"$error":"#NUM!"},3.7148658700887163,-3.7148658700887163,4.5512621809319574E-16,1.1706968128257578,{"$error":"#NUM!"},{"$error":"#NUM!"},{"$error":"#NUM!"},{"$error":"#NUM!"},47.441050008873276,1.0586472250070716E-15,1.0586472250070716E-15,87.340100442375913,7.0446036157245729E-15,-57.500000000000064,20.700000000000024,{"$error":"#NUM!"},0,0,0,-0.12813519892882738,47.441050008873276,1.0586472250070716E-15,87.340100442375913,20.700000000000024,1.1742228888888941E-3]
[20.700000000000024,{"$error":"#NUM!"},{"$error":"#NUM!"},{"$error":"#NUM!"},3.7148658700887163,-3.7148658700887163,4.5512621809319574E-16,1.1706968128257578,{"$error":"#NUM!"},{"$error":"#NUM!"},{"$error":"#NUM!"},{"$error":"#NUM!"},47.441050008873276,1.0586472250070716E-15,1.0586472250070716E-15,87.340100442375913,7.0786355172498134E-15,-57.77777777777785,20.800000000000026,{"$error":"#NUM!"},0,0,0,-0.1310945952043861,47.441050008873276,1.0586472250070716E-15,87.340100442375913,20.800000000000026,1.1945553750000056E-3]
[20.800000000000026,{"$error":"#NUM!"},{"$error":"#NUM!"},{"$error":"#NUM!"},3.7148658700887163,-3.7148658700887163,4.5512621809319574E-16,1.1706968128257578,{"$error":"#NUM!"},{"$error":"#NUM!"},{"$error":"#NUM!"},{"$error":"#NUM!"},47.441050008873276,1.0586472250070716E-15,1.0586472250070716E-15,87.340100442375913,7.1126674187750522E-15,-58.055555555555628,20.900000000000027,{"$error":"#NUM!"},0,0,0,-0.13409846599235653,47.441050008873276,1.0586472250070716E-15,87.340100442375913,20.900000000000027,1.2150623888888949E-3]
[20.900000000000027,{"$error":"#NUM!"},{"$error":"#NUM!"},{"$error":"#NUM!"},3.7148658700887163,-3.7148658700887163,4.5512621809319574E-16,1.1706968128257578,{"$error":"#NUM!"},{"$error":"#NUM!"},{"$error":"#NUM!"},{"$error":"#NUM!"},47.441050008873276,1.0586472250070716E-15,1.0586472250070716E-15,87.340100442375913,7.1466993203002918E-15,-58.333333333333407,21.000000000000028,{"$error":"#NUM!"},0,0,0,-0.13714713592397901,47.441050008873276,1.0586472250070716E-15,87.340100442375913,21.000000000000028,1.2357439305555619E-3]
[21.000000000000028,{"$error":"#NUM!"},{"$error":"#NUM!"},{"$error":"#NUM!"},3.7148658700887163,-3.7148658700887163,4.5512621809319574E-16,1.1706968128257578,{"$error":"#NUM!"},{"$error":"#NUM!"},{"$error":"#NUM!"},{"$error":"#NUM!"},47.441050008873276,1.0586472250070716E-15,1.0586472250070716E-15,87.340100442375913,7.180731221825533E-15,-58.611111111111192,21.10000000000003,{"$error":"#NUM!"},0,0,0,-0.14024092963049417,47.441050008873276,1.0586472250070716E-15,87.340100442375913,21.10000000000003,1.2566000000000066E-3]
[21.10000000000003,{"$error":"#NUM!"},{"$error":"#NUM!"},{"$error":"#NUM!"},3.7148658700887163,-3.7148658700887163,4.5512621809319574E-16,1.1706968128257578,{"$error":"#NUM!"},{"$error":"#NUM!"},{"$error":"#NUM!"},{"$error":"#NUM!"},47.441050008873276,1.0586472250070716E-15,1.0586472250070716E-15,87.340100442375913,7.2147631233507726E-15,-58.888888888888971,21.200000000000031,{"$error":"#NUM!"},0,0,0,-0.14338017174314241,47.441050008873276,1.0586472250070716E-15,87.340100442375913,21.200000000000031,1.2776305972222292E-3]
[21.200000000000031,{"$error":"#NUM!"},{"$error":"#NUM!"},{"$error":"#NUM!"},3.7148658700887163,-3.7148658700887163,4.5512621809319574E-16,1.1706968128257578,{"$error":"#NUM!"},{"$error":"#NUM!"},{"$error":"#NUM!"},{"$error":"#NUM!"},47.441050008873276,1.0586472250070716E-15,1.0586472250070716E-15,87.340100442375913,7.2487950248760122E-15,-59.166666666666757,21.300000000000033,{"$error":"#NUM!"},0,0,0,-0.14656518689316431,47.441050008873276,1.0586472250070716E-15,87.340100442375913,21.300000000000033,1.2988357222222296E-3]
[21.300000000000033,{"$error":"#NUM!"},{"$error":"#NUM!"},{"$error":"#NUM!"},3.7148658700887163,-3.7148658700887163,4.5512621809319574E-16,1.1706968128257578,{"$error":"#NUM!"},{"$error":"#NUM!"},{"$error":"#NUM!"},{"$error":"#NUM!"},47.441050008873276,1.0586472250070716E-15,1.0586472250070716E-15,87.340100442375913,7.2828269264012519E-15,-59.444444444444535,21.400000000000034,{"$error":"#NUM!"},0,0,0,-0.14979629971180031,47.441050008873276,1.0586472250070716E-15,87.340100442375913,21.400000000000034,1.3202153750000076E-3]
[21.400000000000034,{"$error":"#NUM!"},{"$error":"#NUM!"},{"$error":"#NUM!"},3.7148658700887163,-3.7148658700887163,4.5512621809319574E-16,1.1706968128257578,{"$error":"#NUM!"},{"$error":"#NUM!"},{"$error":"#NUM!"},{"$error":"#NUM!"},47.441050008873276,1.0586472250070716E-15,1.0586472250070716E-15,87.340100442375913,7.3168588279264931E-15,-59.722222222222321,21.500000000000036,{"$error":"#NUM!"},0,0,0,-0.15307383483029094,47.441050008873276,1.0586472250070716E-15,87.340100442375913,21.500000000000036,1.3417695555555636E-3]
[21.500000000000036,{"$error":"#NUM!"},{"$error":"#NUM!"},{"$error":"#NUM!"},3.7148658700887163,-3.7148658700887163,4.5512621809319574E-16,1.1706968128257578,{"$error":"#NUM!"},{"$error":"#NUM!"},{"$error":"#NUM!"},{"$error":"#NUM!"},47.441050008873276,1.0586472250070716E-15,1.0586472250070716E-15,87.340100442375913,7.3508907294517327E-15,-60.000000000000099,21.600000000000037,{"$error":"#NUM!"},0,0,0,-0.1563981168798767,47.441050008873276,1.0586472250070716E-15,87.340100442375913,21.600000000000037,1.3634982638888974E-3]
[21.600000000000037,{"$error":"#NUM!"},{"$error":"#NUM!"},{"$error":"#NUM!"},3.7148658700887163,-3.7148658700887163,4.5512621809319574E-16,1.1706968128257578,{"$error":"#NUM!"},{"$error":"#NUM!"},{"$error":"#NUM!"},{"$error":"#NUM!"},47.441050008873276,1.0586472250070716E-15,1.0586472250070716E-15,87.340100442375913,7.3849226309769723E-15,-60.277777777777885,21.700000000000038,{"$error":"#NUM!"},0,0,0,-0.1597694704917981,47.441050008873276,1.0586472250070716E-15,87.340100442375913,21.700000000000038,1.3854015000000089E-3]
[21.700000000000038,{"$error":"#NUM!"},{"$error":"#NUM!"},{"$error":"#NUM!"},3.7148658700887163,-3.7148658700887163,4.5512621809319574E-16,1.1706968128257578,{"$error":"#NUM!"},{"$error":"#NUM!"},{"$error":"#NUM!"},{"$error":"#NUM!"},47.441050008873276,1.0586472250070716E-15,1.0586472250070716E-15,87.340100442375913,7.4189545325022119E-15,-60.555555555555664,21.80000000000004,{"$error":"#NUM!"},0,0,0,-0.1631882202972956,47.441050008873276,1.0586472250070716E-15,87.340100442375913,21.80000000000004,1.4074792638888983E-3]
[21.80000000000004,{"$error":"#NUM!"},{"$error":"#NUM!"},{"$error":"#NUM!"},3.7148658700887163,-3.7148658700887163,4.5512621809319574E-16,1.1706968128257578,{"$error":"#NUM!"},{"$error":"#NUM!"},{"$error":"#NUM!"},{"$error":"#NUM!"},47.441050008873276,1.0586472250070716E-15,1.0586472250070716E-15,87.340100442375913,7.4529864340274515E-15,-60.833333333333442,21.900000000000041,{"$error":"#NUM!"},0,0,0,-0.16665469092760971,47.441050008873276,1.0586472250070716E-15,87.340100442375913,21.900000000000041,1.4297315555555654E-3]
[21.900000000000041,{"$error":"#NUM!"},{"$error":"#NUM!"},{"$error":"#NUM!"},3.7148658700887163,-3.7148658700887163,4.5512621809319574E-16,1.1706968128257578,{"$error":"#NUM!"},{"$error":"#NUM!"},{"$error":"#NUM!"},{"$error":"#NUM!"},47.441050008873276,1.0586472250070716E-15,1.0586472250070716E-15,87.340100442375913,7.4870183355526927E-15,-61.111111111111228,22.000000000000043,{"$error":"#NUM!"},0,0,0,-0.170169207013981,47.441050008873276,1.0586472250070716E-15,87.340100442375913,22.000000000000043,1.45215837500001E-3]
[22.000000000000043,{"$error":"#NUM!"},{"$error":"#NUM!"},{"$error":"#NUM!"},3.7148658700887163,-3.7148658700887163,4.5512621809319574E-16,1.1706968128257578,{"$error":"#NUM!"},{"$error":"#NUM!"},{"$error":"#NUM!"},{"$error":"#NUM!"},47.441050008873276,1.0586472250070716E-15,1.0586472250070716E-15,87.340100442375913,7.5210502370779324E-15,-61.388888888889007,22.100000000000044,{"$error":"#NUM!"},0,0,0,-0.17373209318764987,47.441050008873276,1.0586472250070716E-15,87.340100442375913,22.100000000000044,1.4747597222222327E-3]
[22.100000000000044,{"$error":"#NUM!"},{"$error":"#NUM!"},{"$error":"#NUM!"},3.7148658700887163,-3.7148658700887163,4.5512621809319574E-16,1.1706968128257578,{"$error":"#NUM!"},{"$error":"#NUM!"},{"$error":"#NUM!"},{"$error":"#NUM!"},47.441050008873276,1.0586472250070716E-15,1.0586472250070716E-15,87.340100442375913,7.555082138603172E-15,-61.666666666666792,22.200000000000045,{"$error":"#NUM!"},0,0,0,-0.17734367407985688,47.441050008873276,1.0586472250070716E-15,87.340100442375913,22.200000000000045,1.4975355972222332E-3]
[22.200000000000045,{"$error":"#NUM!"},{"$error":"#NUM!"},{"$error":"#NUM!"},3.7148658700887163,-3.7148658700887163,4.5512621809319574E-16,1.1706968128257578,{"$error":"#NUM!"},{"$error":"#NUM!"},{"$error":"#NUM!"},{"$error":"#NUM!"},47.441050008873276,1.0586472250070716E-15,1.0586472250070716E-15,87.340100442375913,7.5891140401284116E-15,-61.944444444444571,22.300000000000047,{"$error":"#NUM!"},0,0,0,-0.18100427432184255,47.441050008873276,1.0586472250070716E-15,87.340100442375913,22.300000000000047,1.5204860000000114E-3]
[22.300000000000047,{"$error":"#NUM!"},{"$error":"#NUM!"},{"$error":"#NUM!"},3.7148658700887163,-3.7148658700887163,4.5512621809319574E-16,1.1706968128257578,{"$error":"#NUM!"},{"$error":"#NUM!"},{"$error":"#NUM!"},{"$error":"#NUM!"},47.441050008873276,1.0586472250070716E-15,1.0586472250070716E-15,87.340100442375913,7.6231459416536528E-15,-62.222222222222356,22.400000000000048,{"$error":"#NUM!"},0,0,0,{"$f":"IF($B$24=\"C\",IF((3.14159265*1860/4)*((0.001*$B$18)-(2*$B$26*A254))^2*((0.33333*0.001*$B$18)-(2*$B$26*A254))<0,(3.14159265*1860/4)*((0.001*$B$18)-(2*$B$26*A254))^2*((0.33333*0.001*$B$18)-(2*$B$26*A254)),(3.14159265*1860/4)*((0.001*$B$18)-(2*$B$26*A254))^2*((0.33333*0.001*$B$18)-(2*$B$26*A254))),$B$19)","v":-0.18471421854484729},47.441050008873276,1.0586472250070716E-15,87.340100442375913,22.400000000000048,1.5436109305555672E-3]
[22.400000000000048,{"$error":"#NUM!"},{"$error":"#NUM!"},{"$error":"#NUM!"},3.7148658700887163,-3.7148658700887163,4.5512621809319574E-16,1.1706968128257578,{"$error":"#NUM!"},{"$error":"#NUM!"},{"$error":"#NUM!"},{"$error":"#NUM!"},47.441050008873276,1.0586472250070716E-15,1.0586472250070716E-15,87.340100442375913,7.6571778431788908E-15,-62.500000000000135,22.50000000000005,{"$error":"#NUM!"},0,0,0,-0.1884738313801117,47.441050008873276,1.0586472250070716E-15,87.340100442375913,22.50000000000005,1.5669103888889013E-3]
[22.50000000000005,{"$error":"#NUM!"},{"$error":"#NUM!"},{"$error":"#NUM!"},3.7148658700887163,-3.7148658700887163,4.5512621809319574E-16,1.1706968128257578,{"$error":"#NUM!"},{"$error":"#NUM!"},{"$error":"#NUM!"},{"$error":"#NUM!"},47.441050008873276,1.0586472250070716E-15,1.0586472250070716E-15,87.340100442375913,7.691209744704132E-15,-62.777777777777921,22.600000000000051,{"$error":"#NUM!"},0,0,0,-0.19228343745887602,47.441050008873276,1.0586472250070716E-15,87.340100442375913,22.600000000000051,1.5903843750000115E-3]
[22.600000000000051,{"$error":"#NUM!"},{"$error":"#NUM!"},{"$error":"#NUM!"},3.7148658700887163,-3.7148658700887163,4.5512621809319574E-16,1.1706968128257578,{"$error":"#NUM!"},{"$error":"#NUM!"},{"$error":"#NUM!"},{"$error":"#NUM!"},47.441050008873276,1.0586472250070716E-15,1.0586472250070716E-15,87.340100442375913,7.7252416462293717E-15,-63.055555555555699,22.700000000000053,{"$error":"#NUM!"},0,0,0,-0.1961433614123812,47.441050008873276,1.0586472250070716E-15,87.340100442375913,22.700000000000053,1.6140328888889011E-3]
[22.700000000000053,{"$error":"#NUM!"},{"$error":"#NUM!"},{"$error":"#NUM!"},3.7148658700887163,-3.7148658700887163,4.5512621809319574E-16,1.1706968128257578,{"$error":"#NUM!"},{"$error":"#NUM!"},{"$error":"#NUM!"},{"$error":"#NUM!"},47.441050008873276,1.0586472250070716E-15,1.0586472250070716E-15,87.340100442375913,7.7592735477546113E-15,-63.333333333333478,22.800000000000054,{"$error":"#NUM!"},0,0,0,-0.20005392787186746,47.441050008873276,1.0586472250070716E-15,87.340100442375913,22.800000000000054,1.6378559305555683E-3]
[22.800000000000054,{"$error":"#NUM!"},{"$error":"#NUM!"},{"$error":"#NUM!"},3.7148658700887163,-3.7148658700887163,4.5512621809319574E-16,1.1706968128257578,{"$error":"#NUM!"},{"$error":"#NUM!"},{"$error":"#NUM!"},{"$error":"#NUM!"},47.441050008873276,1.0586472250070716E-15,1.0586472250070716E-15,87.340100442375913,0,0,0,{"$error":"#NUM!"},0,0,0,-0.20401546146857535,47.441050008873276,1.0586472250070716E-15,87.340100442375913,0,1.6618535000000132E-3]